ACCESSION: MSBNK-Fac_Eng_Univ_Tokyo-JP008900
RECORD_TITLE: 1,2,3,4-TETRAMETHYLBENZENE; EI-B; MS
DATE: 2016.01.19 (Created 2008.10.21, modified 2011.05.06)
AUTHORS: YAMAMOTO M, DEP. CHEMISTRY, FAC. SCIENCE, NARA WOMEN'S UNIV.
LICENSE: CC BY-NC-SA

CH$NAME: 1,2,3,4-TETRAMETHYLBENZENE
CH$COMPOUND_CLASS: N/A
CH$FORMULA: C10H14
CH$EXACT_MASS: 134.10955
CH$SMILES: Cc(c1)c(C)c(C)c(C)c1
CH$IUPAC: InChI=1S/C10H14/c1-7-5-6-8(2)10(4)9(7)3/h5-6H,1-4H3
CH$LINK: INCHIKEY UOHMMEJUHBCKEE-UHFFFAOYSA-N
CH$LINK: COMPTOX DTXSID4060072

AC$INSTRUMENT: HITACHI RMU-6M
AC$INSTRUMENT_TYPE: EI-B
AC$MASS_SPECTROMETRY: MS_TYPE MS
AC$MASS_SPECTROMETRY: ION_MODE POSITIVE
AC$MASS_SPECTROMETRY: IONIZATION_ENERGY 70 eV

MS$FOCUSED_ION: ION_TYPE [M]+*

PK$SPLASH: splash10-014i-4900000000-28da1a5b7cbbccda1f38
PK$NUM_PEAK: 45
PK$PEAK: m/z int. rel.int.
  27 6.1 61
  29 1.3 13
  38 1 10
  39 0.99 10
  40 1.6 16
  41 8 80
  50 2.5 25
  51 0.71 7
  52 2.2 22
  53 4.9 49
  55 1.2 12
  57.5 0.14 1
  58 1.2 12
  62 1.2 12
  63 4.1 41
  64 0.2 2
  65 6.6 66
  66 2 20
  67 1.4 14
  74 0.1 1
  75 1.2 12
  77 9.7 97
  78 3.5 35
  79 0.43 4
  89 1.8 18
  91 16.8 168
  92 2.2 22
  93 0.19 2
  102 1.4 14
  103 4.6 46
  104 3.2 32
  105 0.48 5
  106 1.2 12
  115 6.8 68
  116 2.6 26
  117 0.68 7
  118 2.5 25
  119 99.99 999
  120 10.6 106
  128 0.1 1
  131 1.2 12
  132 1 10
  133 9.3 93
  134 5.3 53
  135 7 70