ACCESSION: MSBNK-Fac_Eng_Univ_Tokyo-JP008902
RECORD_TITLE: TETRAHYDROFURFURYL ALCOHOL; EI-B; MS
DATE: 2016.01.19 (Created 2008.10.21, modified 2011.05.06)
AUTHORS: YAMAMOTO M, DEP. CHEMISTRY, FAC. SCIENCE, NARA WOMEN'S UNIV.
LICENSE: CC BY-NC-SA

CH$NAME: TETRAHYDROFURFURYL ALCOHOL
CH$COMPOUND_CLASS: N/A
CH$FORMULA: C5H10O2
CH$EXACT_MASS: 102.06808
CH$SMILES: OCC(C1)OCC1
CH$IUPAC: InChI=1S/C5H10O2/c6-4-5-2-1-3-7-5/h5-6H,1-4H2
CH$LINK: COMPTOX DTXSID1029128
CH$LINK: INCHIKEY BSYVTEYKTMYBMK-UHFFFAOYSA-N
CH$LINK: PUBCHEM CID:7360

AC$INSTRUMENT: HITACHI RMU-6M
AC$INSTRUMENT_TYPE: EI-B
AC$MASS_SPECTROMETRY: MS_TYPE MS
AC$MASS_SPECTROMETRY: ION_MODE POSITIVE
AC$MASS_SPECTROMETRY: IONIZATION_ENERGY 70 eV

MS$FOCUSED_ION: ION_TYPE [M]+*

PK$SPLASH: splash10-00dl-9000000000-c623d7fe47c3ac9514e4
PK$NUM_PEAK: 21
PK$PEAK: m/z int. rel.int.
  15 4 40
  26 2.4 24
  27 28.7 287
  28 0.27 3
  29 14.7 147
  31 21.4 214
  38 1.6 16
  39 1.42 14
  40 3 30
  41 41.4 414
  42 12.9 129
  43 7.2 72
  44 8.2 82
  45 1.3 13
  53 1.8 18
  55 0.18 2
  57 3.9 39
  61 1.9 19
  70 4.9 49
  71 99.99 999
  72 4.3 43