ACCESSION: MSBNK-Fac_Eng_Univ_Tokyo-JP008912
RECORD_TITLE: 1,2,3,4-TETRAHYDRONAPHTHALENE; EI-B; MS
DATE: 2016.01.19 (Created 2008.10.21, modified 2011.05.06)
AUTHORS: YAMAMOTO M, DEP. CHEMISTRY, FAC. SCIENCE, NARA WOMEN'S UNIV.
LICENSE: CC BY-NC-SA

CH$NAME: 1,2,3,4-TETRAHYDRONAPHTHALENE
CH$NAME: TETRALINE
CH$COMPOUND_CLASS: N/A
CH$FORMULA: C10H12
CH$EXACT_MASS: 132.09390
CH$SMILES: C(C2)Cc(c1)c(C2)ccc1
CH$IUPAC: InChI=1S/C10H12/c1-2-6-10-8-4-3-7-9(10)5-1/h1-2,5-6H,3-4,7-8H2
CH$LINK: INCHIKEY CXWXQJXEFPUFDZ-UHFFFAOYSA-N
CH$LINK: COMPTOX DTXSID1026118

AC$INSTRUMENT: HITACHI RMU-6M
AC$INSTRUMENT_TYPE: EI-B
AC$MASS_SPECTROMETRY: MS_TYPE MS
AC$MASS_SPECTROMETRY: ION_MODE POSITIVE
AC$MASS_SPECTROMETRY: IONIZATION_ENERGY 70 eV

MS$FOCUSED_ION: ION_TYPE [M]+*

PK$SPLASH: splash10-0udi-4900000000-4f3b43b03b3ec779e310
PK$NUM_PEAK: 46
PK$PEAK: m/z int. rel.int.
  27 5.2 52
  38 1.5 15
  39 11 110
  40 0.11 1
  41 2 20
  50 5.6 56
  51 12.4 124
  52 0.34 3
  53 3.8 38
  57.5 2.4 24
  58 1.5 15
  62 0.26 3
  63 8.3 83
  63.5 1.4 14
  64 5.9 59
  64.5 0.16 2
  65 9.8 98
  66 1.2 12
  74 2.7 27
  75 0.29 3
  76 2.3 23
  77 11.2 112
  78 11.4 114
  79 0.2 2
  87 1.1 11
  89 3.5 35
  90 1 10
  91 4.53 45
  92 3.5 35
  101 1 10
  102 4.4 44
  103 1.05 11
  104 99.99 999
  105 9.5 95
  115 13.2 132
  116 0.6 6
  117 14.4 144
  118 1.9 19
  126 1.1 11
  127 0.41 4
  128 7.8 78
  129 4.9 49
  130 1.6 16
  131 1.33 13
  132 50.9 509
  133 5.7 57