ACCESSION: MSBNK-Fac_Eng_Univ_Tokyo-JP008913
RECORD_TITLE: N,N,N',N'-TETRAMETHYL-1,6-DIAMINOHEXANE; EI-B; MS
DATE: 2016.01.19 (Created 2008.10.21, modified 2011.05.06)
AUTHORS: YAMAMOTO M, DEP. CHEMISTRY, FAC. SCIENCE, NARA WOMEN'S UNIV.
LICENSE: CC BY-NC-SA

CH$NAME: N,N,N',N'-TETRAMETHYL-1,6-DIAMINOHEXANE
CH$COMPOUND_CLASS: N/A
CH$FORMULA: C10H24N2
CH$EXACT_MASS: 172.19395
CH$SMILES: CN(C)CCCCCCN(C)C
CH$IUPAC: InChI=1S/C10H24N2/c1-11(2)9-7-5-6-8-10-12(3)4/h5-10H2,1-4H3
CH$LINK: INCHIKEY TXXWBTOATXBWDR-UHFFFAOYSA-N
CH$LINK: COMPTOX DTXSID5033701

AC$INSTRUMENT: HITACHI RMU-6M
AC$INSTRUMENT_TYPE: EI-B
AC$MASS_SPECTROMETRY: MS_TYPE MS
AC$MASS_SPECTROMETRY: ION_MODE POSITIVE
AC$MASS_SPECTROMETRY: IONIZATION_ENERGY 70 eV

MS$FOCUSED_ION: ION_TYPE [M]+*

PK$SPLASH: splash10-0a4i-9000000000-a6a8bae13b1fbfdce177
PK$NUM_PEAK: 25
PK$PEAK: m/z int. rel.int.
  15 1.4 14
  27 1.1 11
  28 2 20
  29 0.2 2
  30 3.1 31
  41 2.9 29
  42 8.3 83
  43 0.23 2
  44 4.1 41
  45 3.5 35
  46 1.3 13
  55 0.16 2
  56 2 20
  57 1.7 17
  58 99.99 999
  59 0.38 4
  70 1.4 14
  71 1.6 16
  84 5.7 57
  112 0.2 2
  114 4.4 44
  126 1.6 16
  127 2.1 21
  128 0.44 4
  172 3.3 33