ACCESSION: MSBNK-Fac_Eng_Univ_Tokyo-JP008914
RECORD_TITLE: N,N,N',N'-TETRAMETHYL-1,3-DIAMINOBUTANE; EI-B; MS
DATE: 2016.01.19 (Created 2008.10.21, modified 2011.05.06)
AUTHORS: YAMAMOTO M, DEP. CHEMISTRY, FAC. SCIENCE, NARA WOMEN'S UNIV.
LICENSE: CC BY-NC-SA

CH$NAME: N,N,N',N'-TETRAMETHYL-1,3-DIAMINOBUTANE
CH$COMPOUND_CLASS: N/A
CH$FORMULA: C8H20N2
CH$EXACT_MASS: 144.16265
CH$SMILES: CN(C)CCC(C)N(C)C
CH$IUPAC: InChI=1S/C8H20N2/c1-8(10(4)5)6-7-9(2)3/h8H,6-7H2,1-5H3
CH$LINK: INCHIKEY AXFVIWBTKYFOCY-UHFFFAOYSA-N
CH$LINK: COMPTOX DTXSID0026121

AC$INSTRUMENT: HITACHI RMU-6M
AC$INSTRUMENT_TYPE: EI-B
AC$MASS_SPECTROMETRY: MS_TYPE MS
AC$MASS_SPECTROMETRY: ION_MODE POSITIVE
AC$MASS_SPECTROMETRY: IONIZATION_ENERGY 70 eV

MS$FOCUSED_ION: ION_TYPE [M]+*

PK$SPLASH: splash10-05fr-9000000000-8e1cad5e61b3faab039b
PK$NUM_PEAK: 28
PK$PEAK: m/z int. rel.int.
  15 6.1 61
  27 3.6 36
  28 4.3 43
  29 0.5 5
  30 6.8 68
  39 2.5 25
  41 3.6 36
  42 2.73 27
  43 6.5 65
  44 14 140
  45 3.1 31
  55 0.36 4
  56 12.8 128
  57 8.6 86
  58 89.8 898
  59 0.36 4
  68 1.6 16
  70 8.3 83
  71 10.4 104
  72 99.99 999
  73 5.4 54
  84 51.8 518
  85 4.1 41
  86 0.36 4
  98 7.2 72
  99 42.3 423
  100 3.2 32
  144 5.8 58