ACCESSION: MSBNK-Fac_Eng_Univ_Tokyo-JP008934
RECORD_TITLE: SEC-BUTYL BROMIDE; EI-B; MS
DATE: 2016.01.19 (Created 2008.10.21, modified 2011.05.06)
AUTHORS: YAMAMOTO M, DEP. CHEMISTRY, FAC. SCIENCE, NARA WOMEN'S UNIV.
LICENSE: CC BY-NC-SA

CH$NAME: SEC-BUTYL BROMIDE
CH$COMPOUND_CLASS: N/A
CH$FORMULA: C4H9Br
CH$EXACT_MASS: 135.98876
CH$SMILES: CCC(C)Br
CH$IUPAC: InChI=1S/C4H9Br/c1-3-4(2)5/h4H,3H2,1-2H3
CH$LINK: INCHIKEY UPSXAPQYNGXVBF-UHFFFAOYSA-N
CH$LINK: COMPTOX DTXSID7021499

AC$INSTRUMENT: HITACHI RMU-6M
AC$INSTRUMENT_TYPE: EI-B
AC$MASS_SPECTROMETRY: MS_TYPE MS
AC$MASS_SPECTROMETRY: ION_MODE POSITIVE
AC$MASS_SPECTROMETRY: IONIZATION_ENERGY 20 eV

MS$FOCUSED_ION: ION_TYPE [M]+*

PK$SPLASH: splash10-0a4i-9000000000-65295c3e1bdb4fafcc0b
PK$NUM_PEAK: 12
PK$PEAK: m/z int. rel.int.
  27 2.5 25
  28 1.7 17
  29 32.9 329
  39 0.18 2
  41 39.2 392
  42 1.8 18
  55 3 30
  56 0.79 8
  57 99.99 999
  58 4.5 45
  136 1.1 11
  138 1.1 11