ACCESSION: MSBNK-Fac_Eng_Univ_Tokyo-JP008949
RECORD_TITLE: TETRAHYDROFURAN; EI-B; MS
DATE: 2016.01.19 (Created 2008.10.21, modified 2011.05.06)
AUTHORS: YAMAMOTO M, DEP. CHEMISTRY, FAC. SCIENCE, NARA WOMEN'S UNIV.
LICENSE: CC BY-NC-SA

CH$NAME: TETRAHYDROFURAN
CH$COMPOUND_CLASS: N/A
CH$FORMULA: C4H8O
CH$EXACT_MASS: 72.05751
CH$SMILES: C(C1)COC1
CH$IUPAC: InChI=1S/C4H8O/c1-2-4-5-3-1/h1-4H2
CH$LINK: INCHIKEY WYURNTSHIVDZCO-UHFFFAOYSA-N
CH$LINK: COMPTOX DTXSID1021328

AC$INSTRUMENT: HITACHI RMU-6M
AC$INSTRUMENT_TYPE: EI-B
AC$MASS_SPECTROMETRY: MS_TYPE MS
AC$MASS_SPECTROMETRY: ION_MODE POSITIVE
AC$MASS_SPECTROMETRY: IONIZATION_ENERGY 70 eV

MS$FOCUSED_ION: ION_TYPE [M]+*

PK$SPLASH: splash10-0006-9000000000-5fecd52ae1047ea6ca80
PK$NUM_PEAK: 19
PK$PEAK: m/z int. rel.int.
  14 1.8 18
  15 4.7 47
  26 4 40
  27 2.48 25
  28 3.2 32
  29 12.7 127
  31 3.7 37
  37 0.19 2
  38 3.6 36
  39 20.9 209
  40 11.2 112
  41 5.3 53
  42 99.99 999
  43 17 170
  44 4.2 42
  45 0.12 1
  71 27 270
  72 29.5 295
  73 1.6 16