ACCESSION: MSBNK-Fac_Eng_Univ_Tokyo-JP008954
RECORD_TITLE: BUTANE; EI-B; MS
DATE: 2016.01.19 (Created 2008.10.21, modified 2011.05.06)
AUTHORS: YAMAMOTO M, DEP. CHEMISTRY, FAC. SCIENCE, NARA WOMEN'S UNIV.
LICENSE: CC BY-NC-SA

CH$NAME: BUTANE
CH$COMPOUND_CLASS: N/A
CH$FORMULA: C4H10
CH$EXACT_MASS: 58.07825
CH$SMILES: CCCC
CH$IUPAC: InChI=1S/C4H10/c1-3-4-2/h3-4H2,1-2H3
CH$LINK: INCHIKEY IJDNQMDRQITEOD-UHFFFAOYSA-N
CH$LINK: COMPTOX DTXSID7024665

AC$INSTRUMENT: HITACHI RMU-6M
AC$INSTRUMENT_TYPE: EI-B
AC$MASS_SPECTROMETRY: MS_TYPE MS
AC$MASS_SPECTROMETRY: ION_MODE POSITIVE
AC$MASS_SPECTROMETRY: IONIZATION_ENERGY 70 eV

MS$FOCUSED_ION: ION_TYPE [M]+*

PK$SPLASH: splash10-0006-9000000000-8ea252b3301613570d5c
PK$NUM_PEAK: 19
PK$PEAK: m/z int. rel.int.
  14 1 10
  15 1.3 13
  26 4.1 41
  27 2.71 27
  28 26.4 264
  29 36.7 367
  38 1.7 17
  39 1.09 11
  40 1.1 11
  41 28.2 282
  42 28.2 282
  43 99.99 999
  44 3.2 32
  50 1.1 11
  51 1.1 11
  55 0.1 1
  57 2.6 26
  58 13.9 139
  59 0.8 8