ACCESSION: MSBNK-Fac_Eng_Univ_Tokyo-JP009138
RECORD_TITLE: DIMETHYL SULFOXIDE; EI-B; MS
DATE: 2016.01.19 (Created 2008.10.21, modified 2011.05.06)
AUTHORS: SODA AROMATIC CO., LTD.
LICENSE: CC BY-NC-SA

CH$NAME: DIMETHYL SULFOXIDE
CH$COMPOUND_CLASS: N/A
CH$FORMULA: C2H6OS
CH$EXACT_MASS: 78.01394
CH$SMILES: CS(C)=O
CH$IUPAC: InChI=1S/C2H6OS/c1-4(2)3/h1-2H3
CH$LINK: INCHIKEY IAZDPXIOMUYVGZ-UHFFFAOYSA-N
CH$LINK: COMPTOX DTXSID2021735

AC$INSTRUMENT: HITACHI M-80B
AC$INSTRUMENT_TYPE: EI-B
AC$MASS_SPECTROMETRY: MS_TYPE MS
AC$MASS_SPECTROMETRY: ION_MODE POSITIVE
AC$MASS_SPECTROMETRY: IONIZATION_ENERGY 70 eV

MS$FOCUSED_ION: ION_TYPE [M]+*

PK$SPLASH: splash10-03fs-9000000000-378b716bc39417224511
PK$NUM_PEAK: 25
PK$PEAK: m/z int. rel.int.
  13 1.06 11
  14 3.46 35
  15 20.03 200
  27 6.56 66
  29 10.26 103
  31 7.88 79
  32 1.79 18
  33 3.58 36
  34 3.79 38
  35 5.32 53
  44 2.01 20
  45 41.21 412
  46 14.8 148
  47 9.93 99
  48 10.75 108
  49 1.38 14
  58 1.07 11
  61 15.6 156
  62 4.51 45
  63 99.99 999
  64 1.9 19
  65 3.88 39
  78 71.45 715
  79 1.98 20
  80 2.88 29