ACCESSION: MSBNK-Fac_Eng_Univ_Tokyo-JP009205
RECORD_TITLE: PYRUVIC ACID; EI-B; MS
DATE: 2016.01.19 (Created 2008.10.21, modified 2011.05.06)
AUTHORS: SODA AROMATIC CO., LTD.
LICENSE: CC BY-NC-SA

CH$NAME: PYRUVIC ACID
CH$COMPOUND_CLASS: N/A
CH$FORMULA: C3H4O3
CH$EXACT_MASS: 88.01604
CH$SMILES: CC(=O)C(O)=O
CH$IUPAC: InChI=1S/C3H4O3/c1-2(4)3(5)6/h1H3,(H,5,6)
CH$LINK: INCHIKEY LCTONWCANYUPML-UHFFFAOYSA-N
CH$LINK: COMPTOX DTXSID2021650

AC$INSTRUMENT: HITACHI M-80B
AC$INSTRUMENT_TYPE: EI-B
AC$MASS_SPECTROMETRY: MS_TYPE MS
AC$MASS_SPECTROMETRY: ION_MODE POSITIVE
AC$MASS_SPECTROMETRY: IONIZATION_ENERGY 70 eV

MS$FOCUSED_ION: ION_TYPE [M]+*

PK$SPLASH: splash10-0006-9000000000-a2cf85a5e1d2379d26df
PK$NUM_PEAK: 13
PK$PEAK: m/z int. rel.int.
  13 1.16 12
  14 4.1 41
  15 17.16 172
  26 1.42 14
  28 2.25 23
  29 6.12 61
  41 2.49 25
  42 9.65 97
  43 99.99 999
  44 6 60
  45 16.27 163
  56 1.15 12
  88 1.39 14