ACCESSION: MSBNK-Fac_Eng_Univ_Tokyo-JP009296
RECORD_TITLE: TETRAHYDROFURAN; EI-B; MS
DATE: 2016.01.19 (Created 2008.10.21, modified 2011.05.06)
AUTHORS: YAMAMOTO M, DEP. CHEMISTRY, FAC. SCIENCE, NARA WOMEN'S UNIV.
LICENSE: CC BY-NC-SA

CH$NAME: TETRAHYDROFURAN
CH$COMPOUND_CLASS: N/A
CH$FORMULA: C4H8O
CH$EXACT_MASS: 72.05751
CH$SMILES: C(C1)COC1
CH$IUPAC: InChI=1S/C4H8O/c1-2-4-5-3-1/h1-4H2
CH$LINK: INCHIKEY WYURNTSHIVDZCO-UHFFFAOYSA-N
CH$LINK: COMPTOX DTXSID1021328

AC$INSTRUMENT: HITACHI RMU-6M
AC$INSTRUMENT_TYPE: EI-B
AC$MASS_SPECTROMETRY: MS_TYPE MS
AC$MASS_SPECTROMETRY: ION_MODE POSITIVE
AC$MASS_SPECTROMETRY: IONIZATION_ENERGY 20 eV

MS$FOCUSED_ION: ION_TYPE [M]+*

PK$SPLASH: splash10-0006-9000000000-a72cdfa78bc1624af6ee
PK$NUM_PEAK: 13
PK$PEAK: m/z int. rel.int.
  27 8.7 87
  28 1.3 13
  29 3.7 37
  31 0.24 2
  39 3 30
  40 6.6 66
  41 33.7 337
  42 99.99 999
  43 16.3 163
  44 3.3 33
  71 29.9 299
  72 3.26 33
  73 1.7 17