ACCESSION: MSBNK-Fac_Eng_Univ_Tokyo-JP009518
RECORD_TITLE: 1,1,1,3,3,3-HEXAMETHYLDISILAZANE; EI-B; MS
DATE: 2016.01.19 (Created 2008.10.21, modified 2011.05.06)
AUTHORS: NARA WOMEN'S UNIVERSITY
LICENSE: CC BY-NC-SA

CH$NAME: 1,1,1,3,3,3-HEXAMETHYLDISILAZANE
CH$COMPOUND_CLASS: N/A
CH$FORMULA: C6H19NSi2
CH$EXACT_MASS: 161.10560
CH$SMILES: C[Si](C)(C)N[Si](C)(C)C
CH$IUPAC: InChI=1S/C6H19NSi2/c1-8(2,3)7-9(4,5)6/h7H,1-6H3
CH$LINK: CAS 999-97-3
CH$LINK: INCHIKEY FFUAGWLWBBFQJT-UHFFFAOYSA-N
CH$LINK: COMPTOX DTXSID2025395

AC$INSTRUMENT: HITACHI M-80
AC$INSTRUMENT_TYPE: EI-B
AC$MASS_SPECTROMETRY: MS_TYPE MS
AC$MASS_SPECTROMETRY: ION_MODE POSITIVE
AC$MASS_SPECTROMETRY: IONIZATION_ENERGY 70 eV

MS$FOCUSED_ION: ION_TYPE [M]+*

PK$SPLASH: splash10-0002-1900000000-230d51b9fe83539b16b9
PK$NUM_PEAK: 24
PK$PEAK: m/z int. rel.int.
  43 1.23 12
  45 4.57 46
  59 4.71 47
  65 3.68 37
  66 3.67 37
  73 13.38 134
  74 2.4 24
  75 2.84 28
  86 1.12 11
  100 4.16 42
  102 1.07 11
  113 1.59 16
  114 1.07 11
  116 1.93 19
  117 1.26 13
  130 24.55 246
  131 7.57 76
  132 2.89 29
  133 1.67 17
  146 99.99 999
  147 96.8 968
  148 20.45 205
  149 7.14 71
  161 4.27 43