ACCESSION: MSBNK-Fac_Eng_Univ_Tokyo-JP009932
RECORD_TITLE: TRIPHENYLPHOSPHINE OXIDE; EI-B; MS
DATE: 2016.01.19 (Created 2008.10.21, modified 2011.05.06)
AUTHORS: KURARAY CO., LTD.
LICENSE: CC BY-NC-SA

CH$NAME: TRIPHENYLPHOSPHINE OXIDE
CH$COMPOUND_CLASS: N/A
CH$FORMULA: C18H15OP
CH$EXACT_MASS: 278.08605
CH$SMILES: c(c3)ccc(c3)P(=O)(c(c2)cccc2)c(c1)cccc1
CH$IUPAC: InChI=1S/C18H15OP/c19-20(16-10-4-1-5-11-16,17-12-6-2-7-13-17)18-14-8-3-9-15-18/h1-15H
CH$LINK: INCHIKEY FIQMHBFVRAXMOP-UHFFFAOYSA-N
CH$LINK: COMPTOX DTXSID2022121

AC$INSTRUMENT: JEOL JMS-D-300
AC$INSTRUMENT_TYPE: EI-B
AC$MASS_SPECTROMETRY: MS_TYPE MS
AC$MASS_SPECTROMETRY: ION_MODE POSITIVE
AC$MASS_SPECTROMETRY: IONIZATION_ENERGY 70 eV

MS$FOCUSED_ION: ION_TYPE [M]+*

PK$SPLASH: splash10-004i-1290000000-6c346115fe6ef033ad3e
PK$NUM_PEAK: 25
PK$PEAK: m/z int. rel.int.
  28 13.4 134
  32 3 30
  39 0.9 9
  40 0.03 0
  47 3.4 34
  50 1.3 13
  51 7.5 75
  77 0.28 3
  78 1.9 19
  95 1.3 13
  107 15.6 156
  115 0.13 1
  127 0.9 9
  133 1.4 14
  151 1.1 11
  152 0.59 6
  153 3.4 34
  154 3.6 36
  170 1.6 16
  183 0.28 3
  185 8.1 81
  199 12.3 123
  201 16.7 167
  277 99.99 999
  278 56.7 567