ACCESSION: MSBNK-Fac_Eng_Univ_Tokyo-JP010385
RECORD_TITLE: TROPIC ACID; EI-B; MS
DATE: 2016.01.19 (Created 2008.10.21, modified 2011.05.06)
AUTHORS: MASS SPECTROSCOPY SOC. OF JAPAN (MSSJ)
LICENSE: CC BY-NC-SA

CH$NAME: TROPIC ACID
CH$NAME: 2-HYDROXYMETHYLPHENYLACETIC ACID
CH$COMPOUND_CLASS: N/A
CH$FORMULA: C9H10O3
CH$EXACT_MASS: 166.06299
CH$SMILES: OCC(C(O)=O)c(c1)cccc1
CH$IUPAC: InChI=1S/C9H10O3/c10-6-8(9(11)12)7-4-2-1-3-5-7/h1-5,8,10H,6H2,(H,11,12)
CH$LINK: INCHIKEY JACRWUWPXAESPB-UHFFFAOYSA-N
CH$LINK: COMPTOX DTXSID90862179

AC$INSTRUMENT: HITACHI RMU-6M
AC$INSTRUMENT_TYPE: EI-B
AC$MASS_SPECTROMETRY: MS_TYPE MS
AC$MASS_SPECTROMETRY: ION_MODE POSITIVE
AC$MASS_SPECTROMETRY: IONIZATION_ENERGY 20 eV

MS$FOCUSED_ION: ION_TYPE [M]+*

PK$SPLASH: splash10-000l-4900000000-407edf8571758c0b7bb3
PK$NUM_PEAK: 43
PK$PEAK: m/z int. rel.int.
  43 4.6 46
  44 1.1 11
  45 2.1 21
  55 0.18 2
  56 1.7 17
  57 3.2 32
  58 1.8 18
  60 0.24 2
  65 1.5 15
  69 2 20
  70 1.5 15
  71 0.23 2
  73 1.2 12
  77 5.8 58
  78 2.7 27
  79 0.66 7
  81 1.1 11
  83 1.3 13
  84 1 10
  85 0.14 1
  89 2.1 21
  90 18 180
  91 51.5 515
  92 0.76 8
  93 1.1 11
  97 1 10
  103 11.2 112
  104 2.32 23
  105 2.7 27
  107 2.3 23
  118 55.8 558
  119 0.65 7
  120 1.6 16
  121 2.8 28
  135 1.7 17
  136 99.99 999
  137 13.1 131
  138 1.1 11
  147 1 10
  148 0.19 2
  149 1.5 15
  166 0.9 9
  167 0.5 5