ACCESSION: MSBNK-Fac_Eng_Univ_Tokyo-JP010487
RECORD_TITLE: 1,1,3,3-TETRAMETHYLBUTYLAMINE; EI-B; MS
DATE: 2016.01.19 (Created 2008.10.21, modified 2011.05.06)
AUTHORS: TAJIMA S, GUNMA COLLEGE OF TECHNOLOGY
LICENSE: CC BY-NC-SA

CH$NAME: 1,1,3,3-TETRAMETHYLBUTYLAMINE
CH$COMPOUND_CLASS: N/A
CH$FORMULA: C8H19N
CH$EXACT_MASS: 129.15175
CH$SMILES: CC(C)(C)CC(C)(C)N
CH$IUPAC: InChI=1S/C8H19N/c1-7(2,3)6-8(4,5)9/h6,9H2,1-5H3
CH$LINK: INCHIKEY QIJIUJYANDSEKG-UHFFFAOYSA-N
CH$LINK: COMPTOX DTXSID0021886

AC$INSTRUMENT: HITACHI M-80A
AC$INSTRUMENT_TYPE: EI-B
AC$MASS_SPECTROMETRY: MS_TYPE MS
AC$MASS_SPECTROMETRY: ION_MODE POSITIVE
AC$MASS_SPECTROMETRY: IONIZATION_ENERGY 70 eV

MS$FOCUSED_ION: ION_TYPE [M]+*

PK$SPLASH: splash10-0a4i-9000000000-93b97baf6fec7b9896dc
PK$NUM_PEAK: 17
PK$PEAK: m/z int. rel.int.
  15 1.81 18
  18 3.47 35
  27 3.38 34
  28 1.04 10
  29 4.67 47
  30 2.94 29
  39 4.31 43
  41 10.13 101
  42 8.59 86
  43 4.34 43
  55 2.8 28
  56 3.04 30
  57 9.1 91
  58 99.99 999
  59 3.79 38
  72 1.86 19
  114 3.23 32