ACCESSION: MSBNK-Fac_Eng_Univ_Tokyo-JP010502
RECORD_TITLE: N-3-ACETOXY-2,2-DIMETHYLPROPIONYL-N-BUTYL-2,3-DIMETHYLPENT-4-ENAMIDE; EI-B; MS
DATE: 2016.01.19 (Created 2008.10.21, modified 2011.05.06)
AUTHORS: TSUNODA T, FACULTY OF PHARMACEUTICAL SCIENCES, TOKUSHIMA BUNRI UNIV.
LICENSE: CC BY-NC-SA

CH$NAME: N-3-ACETOXY-2,2-DIMETHYLPROPIONYL-N-BUTYL-2,3-DIMETHYLPENT-4-ENAMIDE
CH$COMPOUND_CLASS: N/A
CH$FORMULA: C18H31NO4
CH$EXACT_MASS: 325.22531
CH$SMILES: CCCCN(C(=O)C(C)C(C)C=C)C(=O)C(C)(C)COC(C)=O
CH$IUPAC: InChI=1S/C18H31NO4/c1-8-10-11-19(16(21)14(4)13(3)9-2)17(22)18(6,7)12-23-15(5)20/h9,13-14H,2,8,10-12H2,1,3-7H3
CH$LINK: INCHIKEY QYDLGJPYMBVRDX-UHFFFAOYSA-N

AC$INSTRUMENT: SHIMADZU LKB-9000B
AC$INSTRUMENT_TYPE: EI-B
AC$MASS_SPECTROMETRY: MS_TYPE MS
AC$MASS_SPECTROMETRY: ION_MODE POSITIVE
AC$MASS_SPECTROMETRY: IONIZATION_ENERGY 70 eV

MS$FOCUSED_ION: ION_TYPE [M]+*

PK$SPLASH: splash10-0536-9300000000-260f6d34276540dcda8f
PK$NUM_PEAK: 36
PK$PEAK: m/z int. rel.int.
  27 11.1 111
  29 21.5 215
  30 8.2 82
  39 15.4 154
  41 42.8 428
  42 7.5 75
  43 99.99 999
  44 12.5 125
  53 6.9 69
  55 73.8 738
  56 18.4 184
  57 45.2 452
  67 9 90
  69 19.3 193
  70 33.8 338
  72 9.5 95
  73 13.4 134
  74 6.8 68
  82 6.2 62
  83 44.5 445
  84 19.2 192
  86 8.3 83
  87 16.2 162
  88 6.9 69
  100 18.3 183
  111 12.8 128
  112 5.8 58
  115 27.8 278
  128 22.3 223
  129 17.4 174
  142 5.8 58
  143 19.2 192
  168 35 350
  183 7.2 72
  184 27.8 278
  326 1 10