ACCESSION: MSBNK-Fac_Eng_Univ_Tokyo-JP010507
RECORD_TITLE: N-2(E)-BUTENYL-N-BUTYLHYDROXYACETAMIDE; EI-B; MS
DATE: 2016.01.19 (Created 2008.10.21, modified 2011.05.06)
AUTHORS: TSUNODA T, FACULTY OF PHARMACEUTICAL SCIENCES, TOKUSHIMA BUNRI UNIV.
LICENSE: CC BY-NC-SA

CH$NAME: N-2(E)-BUTENYL-N-BUTYLHYDROXYACETAMIDE
CH$COMPOUND_CLASS: N/A
CH$FORMULA: C10H19NO2
CH$EXACT_MASS: 185.14158
CH$SMILES: CCCCN(CC=CC)C(=O)CO
CH$IUPAC: InChI=1S/C10H19NO2/c1-3-5-7-11(8-6-4-2)10(13)9-12/h3,5,12H,4,6-9H2,1-2H3/b5-3+
CH$LINK: INCHIKEY YFPSYPMBCRPWDE-HWKANZROSA-N

AC$INSTRUMENT: SHIMADZU LKB-9000B
AC$INSTRUMENT_TYPE: EI-B
AC$MASS_SPECTROMETRY: MS_TYPE MS
AC$MASS_SPECTROMETRY: ION_MODE POSITIVE
AC$MASS_SPECTROMETRY: IONIZATION_ENERGY 70 eV

MS$FOCUSED_ION: ION_TYPE [M]+*

PK$SPLASH: splash10-000i-6900000000-1d3a2bd8a6181b521289
PK$NUM_PEAK: 28
PK$PEAK: m/z int. rel.int.
  29 6.3 63
  30 5.1 51
  31 8.2 82
  39 7 70
  41 9 90
  42 5.3 53
  53 5.5 55
  55 74 740
  56 8.2 82
  57 5.3 53
  70 19.9 199
  82 6.9 69
  83 20.6 206
  84 14.2 142
  85 14.5 145
  86 7.2 72
  88 9.2 92
  112 5.8 58
  126 12.7 127
  128 11.8 118
  142 9.3 93
  154 36.7 367
  156 14.9 149
  184 8.4 84
  185 39.6 396
  186 99.99 999
  187 61.2 612
  188 6.9 69