ACCESSION: MSBNK-Fac_Eng_Univ_Tokyo-JP011113
RECORD_TITLE: N-(2-NAPHTHYLMETHYLENE)-METHYLAMINE; EI-B; MS
DATE: 2016.01.19 (Created 2008.10.21, modified 2011.05.06)
AUTHORS: SAWADA M, THE INST. OF SCIENTIFIC AND INDUSTRIALRESEARCH OSAKA UNIV.
LICENSE: CC BY-NC-SA

CH$NAME: N-(2-NAPHTHYLMETHYLENE)-METHYLAMINE
CH$COMPOUND_CLASS: N/A
CH$FORMULA: C12H11N
CH$EXACT_MASS: 169.08915
CH$SMILES: CN=Cc(c1)cc(c2)c(ccc2)c1
CH$IUPAC: InChI=1S/C12H11N/c1-13-9-10-6-7-11-4-2-3-5-12(11)8-10/h2-9H,1H3/b13-9+
CH$LINK: INCHIKEY AGGXQDCVTKTEKZ-UKTHLTGXSA-N

AC$INSTRUMENT: JEOL JMS-DX-300
AC$INSTRUMENT_TYPE: EI-B
AC$MASS_SPECTROMETRY: MS_TYPE MS
AC$MASS_SPECTROMETRY: ION_MODE POSITIVE
AC$MASS_SPECTROMETRY: IONIZATION_ENERGY 70 eV

MS$FOCUSED_ION: ION_TYPE [M]+*

PK$SPLASH: splash10-014i-1900000000-365bed40776114d07e39
PK$NUM_PEAK: 35
PK$PEAK: m/z int. rel.int.
  39 1.7 17
  41 6.7 67
  42 17.3 173
  50 1.6 16
  51 2.6 26
  62 1.2 12
  63 2.7 27
  74 1.6 16
  75 2.3 23
  76 1.6 16
  77 3.2 32
  84 1 10
  85 1.6 16
  87 1.2 12
  89 1.2 12
  101 2.1 21
  102 2.1 21
  113 1 10
  115 4.3 43
  126 6.8 68
  127 14.5 145
  128 12.6 126
  129 3.3 33
  139 5.6 56
  140 2.3 23
  141 12.3 123
  142 4.8 48
  152 1.2 12
  153 15.6 156
  154 3 30
  167 5.7 57
  168 97.4 974
  169 99.99 999
  170 16.5 165
  171 1.3 13