ACCESSION: MSBNK-Fac_Eng_Univ_Tokyo-JP011283
RECORD_TITLE: CARBON TETRABROMIDE; EI-B; MS
DATE: 2016.01.19 (Created 2008.10.21, modified 2011.05.06)
AUTHORS: TAJIMA S, GUNMA COLLEGE OF TECHNOLOGY
LICENSE: CC BY-NC-SA

CH$NAME: CARBON TETRABROMIDE
CH$NAME: TETRABROMOMETHANE
CH$COMPOUND_CLASS: N/A
CH$FORMULA: CBr4
CH$EXACT_MASS: 327.67335
CH$SMILES: BrC(Br)(Br)Br
CH$IUPAC: InChI=1S/CBr4/c2-1(3,4)5
CH$LINK: INCHIKEY HJUGFYREWKUQJT-UHFFFAOYSA-N
CH$LINK: COMPTOX DTXSID8060327

AC$INSTRUMENT: HITACHI M-80A
AC$INSTRUMENT_TYPE: EI-B
AC$MASS_SPECTROMETRY: MS_TYPE MS
AC$MASS_SPECTROMETRY: ION_MODE POSITIVE
AC$MASS_SPECTROMETRY: IONIZATION_ENERGY 70 eV

MS$FOCUSED_ION: ION_TYPE [M]+*

PK$SPLASH: splash10-0udi-5290000000-7cb0064329bc19e56e21
PK$NUM_PEAK: 21
PK$PEAK: m/z int. rel.int.
  12 11.48 115
  79 43.25 433
  80 1.5 15
  81 42.15 422
  82 1.44 14
  91 33.9 339
  93 32.83 328
  125 1.01 10
  126 1.01 10
  158 1.85 19
  160 3.69 37
  162 1.8 18
  170 15.79 158
  172 30.36 304
  174 14.66 147
  249 34.58 346
  251 99.99 999
  252 1.1 11
  253 97.07 971
  254 1.1 11
  255 32.03 320