ACCESSION: MSBNK-Fac_Eng_Univ_Tokyo-JP011316
RECORD_TITLE: N,N-DIMETHYLISOPROPYLAMINE; EI-B; MS
DATE: 2016.01.19 (Created 2008.10.21, modified 2011.05.06)
AUTHORS: YAMAMOTO M, DEP. CHEMISTRY, FAC. SCIENCE, NARA WOMEN'S UNIV.
LICENSE: CC BY-NC-SA

CH$NAME: N,N-DIMETHYLISOPROPYLAMINE
CH$COMPOUND_CLASS: N/A
CH$FORMULA: C5H13N
CH$EXACT_MASS: 87.10480
CH$SMILES: CC(C)N(C)C
CH$IUPAC: InChI=1S/C5H13N/c1-5(2)6(3)4/h5H,1-4H3
CH$LINK: CAS 996-35-0
CH$LINK: INCHIKEY VMOWKUTXPNPTEN-UHFFFAOYSA-N
CH$LINK: COMPTOX DTXSID2033447

AC$INSTRUMENT: HITACHI M-2500
AC$INSTRUMENT_TYPE: EI-B
AC$MASS_SPECTROMETRY: MS_TYPE MS
AC$MASS_SPECTROMETRY: ION_MODE POSITIVE
AC$MASS_SPECTROMETRY: IONIZATION_ENERGY 70 eV

MS$FOCUSED_ION: ION_TYPE [M]+*

PK$SPLASH: splash10-00di-9000000000-7567b1be5990df584093
PK$NUM_PEAK: 20
PK$PEAK: m/z int. rel.int.
  15 3.48 35
  18 1.07 11
  27 2.85 29
  28 2.65 27
  29 1.39 14
  30 1.8 18
  39 2.39 24
  41 3.82 38
  42 11.95 120
  43 5.22 52
  44 23.03 230
  56 9.12 91
  57 3.38 34
  70 5.09 51
  71 3.74 37
  72 99.99 999
  73 5.03 50
  86 6.12 61
  87 23.21 232
  88 1.44 14