ACCESSION: MSBNK-Fac_Eng_Univ_Tokyo-JP011359
RECORD_TITLE: SILACYCLOHEXANE; EI-B; MS
DATE: 2016.01.19 (Created 2008.10.21, modified 2011.05.06)
AUTHORS: YAMAMOTO M, DEP. CHEMISTRY, FAC. SCIENCE, NARA WOMEN'S UNIV.
LICENSE: CC BY-NC-SA

CH$NAME: SILACYCLOHEXANE
CH$COMPOUND_CLASS: N/A
CH$FORMULA: C5H12Si
CH$EXACT_MASS: 100.07083
CH$SMILES: C(C1)CC[SiH2]C1
CH$IUPAC: InChI=1S/C5H12Si/c1-2-4-6-5-3-1/h1-6H2
CH$LINK: INCHIKEY VMNDCBPWBMKDBI-UHFFFAOYSA-N
CH$LINK: COMPTOX DTXSID60798118

AC$INSTRUMENT: HITACHI RMU-6M
AC$INSTRUMENT_TYPE: EI-B
AC$MASS_SPECTROMETRY: MS_TYPE MS
AC$MASS_SPECTROMETRY: ION_MODE POSITIVE
AC$MASS_SPECTROMETRY: IONIZATION_ENERGY 70 eV

MS$FOCUSED_ION: ION_TYPE [M]+*

PK$SPLASH: splash10-00di-9100000000-ee6c8ed6514e9a8618b2
PK$NUM_PEAK: 42
PK$PEAK: m/z int. rel.int.
  26 0.7 7
  27 4.9 49
  28 4.6 46
  29 5.2 52
  30 1.4 14
  31 5.9 59
  32 0.9 9
  39 5.5 55
  40 0.7 7
  41 7 70
  42 4.3 43
  43 22.8 228
  44 27.4 274
  45 9.8 98
  46 1.5 15
  53 2.7 27
  54 1.1 11
  55 6.6 66
  56 2.5 25
  57 6.8 68
  58 10.2 102
  59 9.6 96
  60 1.1 11
  65 0.6 6
  66 1.4 14
  67 1.8 18
  68 0.6 6
  69 2.7 27
  70 10.8 108
  71 22.2 222
  72 99.99 999
  73 9.3 93
  74 3.4 34
  83 2.6 26
  85 3 30
  95 0.6 6
  97 6.2 62
  98 6 60
  99 10.2 102
  100 39.6 396
  101 4.5 45
  102 1.5 15