ACCESSION: MSBNK-Fac_Eng_Univ_Tokyo-JP011477
RECORD_TITLE: ETHYL 2-FLUORENYLMETHYLCARBOXYLATE; EI-B; MS
DATE: 2016.01.19 (Created 2008.10.21, modified 2011.05.06)
AUTHORS: FUJISE Y, HAMAMATSU UNIV. SCHOOL OF MEDICINE
LICENSE: CC BY-NC-SA

CH$NAME: ETHYL 2-FLUORENYLMETHYLCARBOXYLATE
CH$COMPOUND_CLASS: N/A
CH$FORMULA: C17H16O2
CH$EXACT_MASS: 252.11503
CH$SMILES: CCOC(=O)Cc(c3)cc(C1)c(c3)c(c2)c(ccc2)1
CH$IUPAC: InChI=1S/C17H16O2/c1-2-19-17(18)10-12-7-8-16-14(9-12)11-13-5-3-4-6-15(13)16/h3-9H,2,10-11H2,1H3
CH$LINK: INCHIKEY JIUOWDAPJJNCNT-UHFFFAOYSA-N

AC$INSTRUMENT: JEOL JMS-DX-300
AC$INSTRUMENT_TYPE: EI-B
AC$MASS_SPECTROMETRY: MS_TYPE MS
AC$MASS_SPECTROMETRY: ION_MODE POSITIVE
AC$MASS_SPECTROMETRY: IONIZATION_ENERGY 70 eV

MS$FOCUSED_ION: ION_TYPE [M]+*

PK$SPLASH: splash10-004i-0920000000-b8b58e1d411d41c93a6e
PK$NUM_PEAK: 33
PK$PEAK: m/z int. rel.int.
  43 1.28 13
  45 1.4 14
  51 0.96 10
  63 1.03 10
  76 2.65 27
  89 4.1 41
  90 2.97 30
  126 0.86 9
  127 0.67 7
  128 0.88 9
  139 1.39 14
  150 1.73 17
  151 4.5 45
  152 9.18 92
  153 1.54 15
  163 0.84 8
  164 0.62 6
  165 3.68 37
  166 0.94 9
  167 0.65 7
  175 0.75 8
  176 8.22 82
  177 8.44 84
  178 63.66 637
  179 99.99 999
  180 15.93 159
  181 1.16 12
  223 4.27 43
  224 1.38 14
  251 0.74 7
  252 49.47 495
  253 9.26 93
  254 0.99 10