ACCESSION: MSBNK-Fac_Eng_Univ_Tokyo-JP011558
RECORD_TITLE: 1,1,1,2-TETRAMETHYLDISILANE; EI-B; MS
DATE: 2016.01.19 (Created 2008.10.21, modified 2011.05.06)
AUTHORS: YAMAMOTO M, DEP. CHEMISTRY, FAC. SCIENCE, NARA WOMEN'S UNIV.
LICENSE: CC BY-NC-SA

CH$NAME: 1,1,1,2-TETRAMETHYLDISILANE
CH$COMPOUND_CLASS: N/A
CH$FORMULA: C4H14Si2
CH$EXACT_MASS: 118.06340
CH$SMILES: C[SiH2][Si](C)(C)C
CH$IUPAC: InChI=1S/C4H14Si2/c1-5-6(2,3)4/h5H2,1-4H3
CH$LINK: INCHIKEY VIPCDVWYAADTGR-UHFFFAOYSA-N

AC$INSTRUMENT: HITACHI RMU-6M
AC$INSTRUMENT_TYPE: EI-B
AC$MASS_SPECTROMETRY: MS_TYPE MS
AC$MASS_SPECTROMETRY: ION_MODE POSITIVE
AC$MASS_SPECTROMETRY: IONIZATION_ENERGY 20 eV

MS$FOCUSED_ION: ION_TYPE [M]+*

PK$SPLASH: splash10-00di-9200000000-2c13c851d6a657abe09f
PK$NUM_PEAK: 19
PK$PEAK: m/z int. rel.int.
  43 5.5 55
  44 1.1 11
  45 6 60
  59 4.3 43
  72 1.7 17
  73 99.99 999
  74 9.3 93
  75 4 40
  87 1.1 11
  101 3.2 32
  102 3.3 33
  103 11.5 115
  104 2.1 21
  105 1 10
  116 2.6 26
  117 3.6 36
  118 12.5 125
  119 2.4 24
  120 1.1 11