ACCESSION: MSBNK-Fac_Eng_Univ_Tokyo-JP011569
RECORD_TITLE: SILACYCLOHEXANE (1,1-D2); EI-B; MS
DATE: 2016.01.19 (Created 2008.10.21, modified 2011.05.06)
AUTHORS: YAMAMOTO M, DEP. CHEMISTRY, FAC. SCIENCE, NARA WOMEN'S UNIV.
LICENSE: CC BY-NC-SA

CH$NAME: SILACYCLOHEXANE (1,1-D2)
CH$COMPOUND_CLASS: N/A
CH$FORMULA: C5H12Si
CH$EXACT_MASS: 100.07083
CH$SMILES: [2H][Si]([2H])(C1)CCCC1
CH$IUPAC: InChI=1S/C5H12Si/c1-2-4-6-5-3-1/h1-6H2/i6D2
CH$LINK: INCHIKEY VMNDCBPWBMKDBI-NCYHJHSESA-N

AC$INSTRUMENT: HITACHI RMU-6M
AC$INSTRUMENT_TYPE: EI-B
AC$MASS_SPECTROMETRY: MS_TYPE MS
AC$MASS_SPECTROMETRY: ION_MODE POSITIVE
AC$MASS_SPECTROMETRY: IONIZATION_ENERGY 20 eV

MS$FOCUSED_ION: ION_TYPE [M]+*

PK$SPLASH: splash10-00di-9200000000-1b0ea07eb7974c43f59e
PK$NUM_PEAK: 32
PK$PEAK: m/z int. rel.int.
  28 1.4 14
  32 1.3 13
  41 2.3 23
  43 3.5 35
  44 8.8 88
  45 15.1 151
  46 9.6 96
  47 1.9 19
  57 1.9 19
  58 4.1 41
  59 8.1 81
  60 5 50
  61 7.2 72
  70 3.6 36
  71 6.6 66
  72 17.8 178
  73 39.2 392
  74 99.99 999
  75 9.9 99
  76 4.3 43
  83 1.7 17
  84 1.4 14
  86 2.4 24
  87 2.2 22
  97 3.3 33
  98 7.6 76
  99 3.9 39
  100 8.5 85
  101 2.4 24
  102 61.1 611
  103 6.9 69
  104 2.7 27