ACCESSION: MSBNK-Fac_Eng_Univ_Tokyo-JP011577
RECORD_TITLE: SILACYCLOHEXANE (2,2,6,6-D4); EI-B; MS
DATE: 2016.01.19 (Created 2008.10.21, modified 2011.05.06)
AUTHORS: YAMAMOTO M, DEP. CHEMISTRY, FAC. SCIENCE, NARA WOMEN'S UNIV.
LICENSE: CC BY-NC-SA

CH$NAME: SILACYCLOHEXANE (2,2,6,6-D4)
CH$COMPOUND_CLASS: N/A
CH$FORMULA: C5H12Si
CH$EXACT_MASS: 100.07083
CH$SMILES: [2H]C([2H])(C1)[SiH2]C([2H])([2H])CC1
CH$IUPAC: InChI=1S/C5H12Si/c1-2-4-6-5-3-1/h1-6H2/i4D2,5D2
CH$LINK: INCHIKEY VMNDCBPWBMKDBI-CQOLUAMGSA-N

AC$INSTRUMENT: HITACHI RMU-6M
AC$INSTRUMENT_TYPE: EI-B
AC$MASS_SPECTROMETRY: MS_TYPE MS
AC$MASS_SPECTROMETRY: ION_MODE POSITIVE
AC$MASS_SPECTROMETRY: IONIZATION_ENERGY 20 eV

MS$FOCUSED_ION: ION_TYPE [M]+*

PK$SPLASH: splash10-0fk9-9300000000-5cca8ed371f2cfa6fc05
PK$NUM_PEAK: 32
PK$PEAK: m/z int. rel.int.
  42 1.1 11
  43 2.6 26
  44 12.1 121
  45 11.3 113
  46 11.3 113
  47 3.6 36
  57 2 20
  58 2 20
  59 3.8 38
  60 12.2 122
  61 9.2 92
  62 3.5 35
  71 2.6 26
  72 9.3 93
  73 21.5 215
  74 99.99 999
  75 24.3 243
  76 26.3 263
  77 2.8 28
  78 1.3 13
  85 1.8 18
  86 1.4 14
  87 3.1 31
  88 1.3 13
  89 1.7 17
  100 3 30
  101 5.2 52
  102 9.9 99
  103 16 160
  104 62.1 621
  105 8.9 89
  106 3 30