ACCESSION: MSBNK-Fac_Eng_Univ_Tokyo-JP011579
RECORD_TITLE: SILACYCLOPENTANE; EI-B; MS
DATE: 2016.01.19 (Created 2008.10.21, modified 2011.05.06)
AUTHORS: YAMAMOTO M, DEP. CHEMISTRY, FAC. SCIENCE, NARA WOMEN'S UNIV.
LICENSE: CC BY-NC-SA

CH$NAME: SILACYCLOPENTANE
CH$COMPOUND_CLASS: N/A
CH$FORMULA: C4H10Si
CH$EXACT_MASS: 86.05518
CH$SMILES: C(C1)C[SiH2]C1
CH$IUPAC: InChI=1S/C4H10Si/c1-2-4-5-3-1/h1-5H2
CH$LINK: INCHIKEY DWRSCILTXDLQBG-UHFFFAOYSA-N

AC$INSTRUMENT: HITACHI RMU-6M
AC$INSTRUMENT_TYPE: EI-B
AC$MASS_SPECTROMETRY: MS_TYPE MS
AC$MASS_SPECTROMETRY: ION_MODE POSITIVE
AC$MASS_SPECTROMETRY: IONIZATION_ENERGY 70 eV

MS$FOCUSED_ION: ION_TYPE [M]+*

PK$SPLASH: splash10-0a4i-9000000000-6f97781d8fd889cef70a
PK$NUM_PEAK: 28
PK$PEAK: m/z int. rel.int.
  26 1.2 12
  27 4.9 49
  28 6.3 63
  29 9.2 92
  30 3 30
  31 4.8 48
  39 3.8 38
  41 1.5 15
  42 3.1 31
  43 27.3 273
  44 4.4 44
  45 3.8 38
  53 5.1 51
  54 2.2 22
  55 7.7 77
  56 8.4 84
  57 12.2 122
  58 99.99 999
  59 9.3 93
  60 4.2 42
  67 1.2 12
  71 2.5 25
  83 2.1 21
  84 3.6 36
  85 6.9 69
  86 24.7 247
  87 2.7 27
  88 1 10