ACCESSION: MSBNK-Fac_Eng_Univ_Tokyo-JP011700
RECORD_TITLE: 1,2-DICHLORO-1,2-DIETHYL-1,2-DIMETHYLDISILANE; EI-B; MS
DATE: 2016.01.19 (Created 2008.10.21, modified 2011.05.06)
AUTHORS: FAC. TECHNOLOGY, HIROSHIMA UNIV.
LICENSE: CC BY-NC-SA

CH$NAME: 1,2-DICHLORO-1,2-DIETHYL-1,2-DIMETHYLDISILANE
CH$COMPOUND_CLASS: N/A
CH$FORMULA: C6H16Cl2Si2
CH$EXACT_MASS: 214.01676
CH$SMILES: CC[Si](C)(Cl)[Si](C)(Cl)CC
CH$IUPAC: InChI=1S/C6H16Cl2Si2/c1-5-9(3,7)10(4,8)6-2/h5-6H2,1-4H3
CH$LINK: INCHIKEY SHNKFHWZADNPMU-UHFFFAOYSA-N
CH$LINK: COMPTOX DTXSID00763461

AC$INSTRUMENT: SHIMADZU QP-1000
AC$INSTRUMENT_TYPE: EI-B
AC$MASS_SPECTROMETRY: MS_TYPE MS
AC$MASS_SPECTROMETRY: ION_MODE POSITIVE
AC$MASS_SPECTROMETRY: IONIZATION_ENERGY 70 eV

MS$FOCUSED_ION: ION_TYPE [M]+*

PK$SPLASH: splash10-00di-9200000000-fcf4f5923d6800e759e2
PK$NUM_PEAK: 33
PK$PEAK: m/z int. rel.int.
  56 3.2 32
  58 4.2 42
  59 3.2 32
  60 27.4 274
  61 1.1 11
  62 3.2 32
  63 12.6 126
  65 5.3 53
  70 4.2 42
  71 4.2 42
  72 99.99 999
  73 16.8 168
  74 3.2 32
  78 4.2 42
  79 44.2 442
  80 3.2 32
  81 15.8 158
  87 18.9 189
  88 1.1 11
  89 2.1 21
  93 3.2 32
  101 2.1 21
  106 8.4 84
  107 30.5 305
  108 5.3 53
  109 9.5 95
  151 2.1 21
  157 1.1 11
  179 5.3 53
  181 3.2 32
  185 1.1 11
  214 1.8 18
  216 1.2 12