ACCESSION: MSBNK-Fac_Eng_Univ_Tokyo-JP011787
RECORD_TITLE: TRIMETHYLCHLOROSILANE; EI-B; MS
DATE: 2016.01.19 (Created 2008.10.21, modified 2011.05.06)
AUTHORS: TAJIMA S, GUNMA COLLEGE OF TECHNOLOGY
LICENSE: CC BY-NC-SA

CH$NAME: TRIMETHYLCHLOROSILANE
CH$COMPOUND_CLASS: N/A
CH$FORMULA: C3H9ClSi
CH$EXACT_MASS: 108.01620
CH$SMILES: C[Si](C)(C)Cl
CH$IUPAC: InChI=1S/C3H9ClSi/c1-5(2,3)4/h1-3H3
CH$LINK: INCHIKEY IJOOHPMOJXWVHK-UHFFFAOYSA-N
CH$LINK: COMPTOX DTXSID2024822

AC$INSTRUMENT: HITACHI M-80A
AC$INSTRUMENT_TYPE: EI-B
AC$MASS_SPECTROMETRY: MS_TYPE MS
AC$MASS_SPECTROMETRY: ION_MODE POSITIVE
AC$MASS_SPECTROMETRY: IONIZATION_ENERGY 70 eV

MS$FOCUSED_ION: ION_TYPE [M]+*

PK$SPLASH: splash10-0006-9000000000-8e86a7f30d7033195a51
PK$NUM_PEAK: 18
PK$PEAK: m/z int. rel.int.
  63 6.22 62
  65 6.1 61
  67 1.71 17
  72 1.32 13
  73 26.79 268
  74 2.37 24
  75 1.16 12
  77 1.59 16
  78 2.25 23
  79 2.89 29
  92 1.4 14
  93 99.99 999
  94 8.33 83
  95 37.79 378
  96 2.68 27
  97 1.2 12
  108 10.22 102
  110 3.84 38