ACCESSION: MSBNK-Fac_Eng_Univ_Tokyo-JP011793
RECORD_TITLE: TRIMETHYLETHOXYSILANE; EI-B; MS
DATE: 2016.01.19 (Created 2008.10.21, modified 2011.05.06)
AUTHORS: TAJIMA S, GUNMA COLLEGE OF TECHNOLOGY
LICENSE: CC BY-NC-SA

CH$NAME: TRIMETHYLETHOXYSILANE
CH$COMPOUND_CLASS: N/A
CH$FORMULA: C5H14OSi
CH$EXACT_MASS: 118.08139
CH$SMILES: CCO[Si](C)(C)C
CH$IUPAC: InChI=1S/C5H14OSi/c1-5-6-7(2,3)4/h5H2,1-4H3
CH$LINK: COMPTOX DTXSID5051814
CH$LINK: INCHIKEY RSIHJDGMBDPTIM-UHFFFAOYSA-N
CH$LINK: PUBCHEM CID:15772

AC$INSTRUMENT: HITACHI M-80A
AC$INSTRUMENT_TYPE: EI-B
AC$MASS_SPECTROMETRY: MS_TYPE MS
AC$MASS_SPECTROMETRY: ION_MODE POSITIVE
AC$MASS_SPECTROMETRY: IONIZATION_ENERGY 70 eV

MS$FOCUSED_ION: ION_TYPE [M]+*

PK$SPLASH: splash10-0ufr-9400000000-9879624f3f173e4aa797
PK$NUM_PEAK: 30
PK$PEAK: m/z int. rel.int.
  14 3.79 38
  15 13.2 132
  26 2 20
  27 7.9 79
  29 8.14 81
  31 1.56 16
  42 2.69 27
  43 15.88 159
  44 4.19 42
  45 20.52 205
  46 1.56 16
  47 5.66 57
  51 2.85 29
  55 1.51 15
  57 1.17 12
  58 4.49 45
  59 23.08 231
  60 2.48 25
  61 6.36 64
  72 1.23 12
  73 25.7 257
  74 3.1 31
  75 59.09 591
  76 4.47 45
  77 3.63 36
  87 1.18 12
  103 99.99 999
  104 9.69 97
  105 5.41 54
  118 2.41 24