ACCESSION: MSBNK-Fac_Eng_Univ_Tokyo-JP011858
RECORD_TITLE: N-(2-PROPENOXYBENZYLIDENE)(PHENYLTRIMETHYLSILYL)METHYLAMINE; EI-B; MS
DATE: 2016.01.19 (Created 2008.10.21, modified 2011.05.06)
AUTHORS: YOSHIKI O, FAC, TECHNOLOGY, OSAKA UNIV.
LICENSE: CC BY-NC-SA

CH$NAME: N-(2-PROPENOXYBENZYLIDENE)(PHENYLTRIMETHYLSILYL)METHYLAMINE
CH$COMPOUND_CLASS: N/A
CH$FORMULA: C20H26NOSi
CH$EXACT_MASS: 324.17837
CH$SMILES: N/A
CH$IUPAC: N/A

AC$INSTRUMENT: Unknown
AC$INSTRUMENT_TYPE: EI-B
AC$MASS_SPECTROMETRY: MS_TYPE MS
AC$MASS_SPECTROMETRY: ION_MODE POSITIVE
AC$MASS_SPECTROMETRY: IONIZATION_ENERGY 70 eV

MS$FOCUSED_ION: ION_TYPE [M]+*

PK$SPLASH: splash10-00di-9550000000-d99a405d4462a3550f80
PK$NUM_PEAK: 87
PK$PEAK: m/z int. rel.int.
  50 2.7 27
  51 13.8 138
  52 3.4 34
  53 1.8 18
  55 3.7 37
  57 3.8 38
  58 2.2 22
  59 9.3 93
  63 3.6 36
  64 2.4 24
  65 4.1 41
  69 1.5 15
  73 99.99 999
  74 9.6 96
  75 7.3 73
  76 2.7 27
  77 15.7 157
  78 10.7 107
  79 2.2 22
  89 17.8 178
  90 13 130
  91 24.7 247
  92 2.3 23
  103 2.8 28
  104 4.7 47
  105 8.4 84
  106 5.5 55
  107 2.6 26
  115 3.7 37
  116 4.2 42
  117 6.1 61
  118 2.1 21
  119 1.8 18
  121 2.3 23
  127 1.8 18
  128 1.6 16
  129 1.8 18
  131 7.9 79
  132 6.7 67
  133 1.6 16
  135 8.1 81
  144 4.6 46
  145 9.7 97
  146 2.2 22
  147 2.1 21
  149 5.3 53
  151 2 20
  152 3.1 31
  162 4.5 45
  163 2.7 27
  164 1.9 19
  165 4 40
  176 5.5 55
  177 2.2 22
  178 5.4 54
  179 2 20
  180 14.3 143
  181 6.8 68
  189 2 20
  190 6.4 64
  191 2.4 24
  192 1.7 17
  193 1.6 16
  208 8.5 85
  209 8.4 84
  210 2.9 29
  216 4.4 44
  217 1.8 18
  219 1.9 19
  232 1.5 15
  233 2.1 21
  234 2.9 29
  235 1.6 16
  246 2.5 25
  250 4.5 45
  265 10.6 106
  266 38.4 384
  267 14.6 146
  268 3.9 39
  280 2.3 23
  281 6.8 68
  282 40 400
  283 9.3 93
  284 2.5 25
  322 14.8 148
  323 6.1 61
  324 1.7 17