ACCESSION: MSBNK-Fac_Eng_Univ_Tokyo-JP011953
RECORD_TITLE: ETHOXYTRIMETHYLSILANE; EI-B; MS
DATE: 2016.01.19 (Created 2008.10.21, modified 2011.05.06)
AUTHORS: ISHIKAWA M, HIROSHIMA UNIV. FAC. TEQUNOLOGY
LICENSE: CC BY-NC-SA

CH$NAME: ETHOXYTRIMETHYLSILANE
CH$COMPOUND_CLASS: N/A
CH$FORMULA: C5H14OSi
CH$EXACT_MASS: 118.08139
CH$SMILES: CCO[Si](C)(C)C
CH$IUPAC: InChI=1S/C5H14OSi/c1-5-6-7(2,3)4/h5H2,1-4H3
CH$LINK: INCHIKEY RSIHJDGMBDPTIM-UHFFFAOYSA-N
CH$LINK: COMPTOX DTXSID5051814

AC$INSTRUMENT: SHIMADZU QP-1000
AC$INSTRUMENT_TYPE: EI-B
AC$MASS_SPECTROMETRY: MS_TYPE MS
AC$MASS_SPECTROMETRY: ION_MODE POSITIVE
AC$MASS_SPECTROMETRY: IONIZATION_ENERGY 70 eV

MS$FOCUSED_ION: ION_TYPE [M]+*

PK$SPLASH: splash10-0h00-9200000000-82b3d110a5f48b20282c
PK$NUM_PEAK: 18
PK$PEAK: m/z int. rel.int.
  52 2.1 21
  53 5.8 58
  54 1.1 11
  56 2.1 21
  58 2.1 21
  59 11.6 116
  60 55.3 553
  61 5.3 53
  62 12.1 121
  73 41.1 411
  75 99.99 999
  76 6.3 63
  77 3.2 32
  102 1.1 11
  103 69.5 695
  104 5.8 58
  105 2.1 21
  118 0.4 4