ACCESSION: MSBNK-Fac_Eng_Univ_Tokyo-JP012014
RECORD_TITLE: 1,1-DIETHYL-2,2-DIMETHYLDISILANE; EI-B; MS
DATE: 2016.01.19 (Created 2008.10.21, modified 2011.05.06)
AUTHORS: YAMAMOTO M, DEP. CHEMISTRY, FAC. SCIENCE, NARA WOMEN'S UNIV.
LICENSE: CC BY-NC-SA

CH$NAME: 1,1-DIETHYL-2,2-DIMETHYLDISILANE
CH$COMPOUND_CLASS: N/A
CH$FORMULA: C6H18Si2
CH$EXACT_MASS: 146.09470
CH$SMILES: CC[SiH](CC)[SiH](C)C
CH$IUPAC: InChI=1S/C6H18Si2/c1-5-8(6-2)7(3)4/h7-8H,5-6H2,1-4H3
CH$LINK: INCHIKEY OONIWCFTRWGZGX-UHFFFAOYSA-N

AC$INSTRUMENT: HITACHI RMU-6M
AC$INSTRUMENT_TYPE: EI-B
AC$MASS_SPECTROMETRY: MS_TYPE MS
AC$MASS_SPECTROMETRY: ION_MODE POSITIVE
AC$MASS_SPECTROMETRY: IONIZATION_ENERGY 70 eV

MS$FOCUSED_ION: ION_TYPE [M]+*

PK$SPLASH: splash10-0a4r-9100000000-41867fd19898c85dfdfb
PK$NUM_PEAK: 59
PK$PEAK: m/z int. rel.int.
  27 4.6 46
  28 4.4 44
  29 14.2 142
  30 1 10
  31 23.2 232
  32 1.4 14
  39 1 10
  41 2.9 29
  42 2.9 29
  43 40.3 403
  44 4.5 45
  45 22.9 229
  46 1.3 13
  53 3.4 34
  54 1.4 14
  55 6.6 66
  56 3.9 39
  57 15 150
  58 66.2 662
  59 99.99 999
  60 8.7 87
  61 2.6 26
  69 7.3 73
  70 2.8 28
  71 7.2 72
  72 3.4 34
  73 9.5 95
  74 4.2 42
  75 7.2 72
  81 2.4 24
  83 2.3 23
  84 1.2 12
  85 6.5 65
  86 76.2 762
  87 53.8 538
  88 11.8 118
  89 42.1 421
  90 6.8 68
  91 3.5 35
  99 1.4 14
  101 7.9 79
  102 5.1 51
  103 10.7 107
  104 1.6 16
  105 4.3 43
  107 4.9 49
  116 2.8 28
  117 10.5 105
  118 1.9 19
  119 2.3 23
  130 2.8 28
  131 4.4 44
  132 1.1 11
  133 2.9 29
  135 2.7 27
  145 3.1 31
  146 29.3 293
  147 6.1 61
  148 3.3 33