ACCESSION: MSBNK-Fac_Eng_Univ_Tokyo-JP012025
RECORD_TITLE: 1,1,2,2,3,3-HEXAMETHYLTRISILANE; EI-B; MS
DATE: 2016.01.19 (Created 2008.10.21, modified 2011.05.06)
AUTHORS: YAMAMOTO M, DEP. CHEMISTRY, FAC. SCIENCE, NARA WOMEN'S UNIV.
LICENSE: CC BY-NC-SA

CH$NAME: 1,1,2,2,3,3-HEXAMETHYLTRISILANE
CH$COMPOUND_CLASS: N/A
CH$FORMULA: C6H20Si3
CH$EXACT_MASS: 176.08728
CH$SMILES: C[SiH](C)[Si](C)(C)[SiH](C)C
CH$IUPAC: InChI=1S/C6H20Si3/c1-7(2)9(5,6)8(3)4/h7-8H,1-6H3
CH$LINK: INCHIKEY JSBOVJABZFDRGV-UHFFFAOYSA-N

AC$INSTRUMENT: HITACHI RMU-6M
AC$INSTRUMENT_TYPE: EI-B
AC$MASS_SPECTROMETRY: MS_TYPE MS
AC$MASS_SPECTROMETRY: ION_MODE POSITIVE
AC$MASS_SPECTROMETRY: IONIZATION_ENERGY 70 eV

MS$FOCUSED_ION: ION_TYPE [M]+*

PK$SPLASH: splash10-01b9-9800000000-ef0e18f8264da24d4b2e
PK$NUM_PEAK: 53
PK$PEAK: m/z int. rel.int.
  28 1.2 12
  29 4.1 41
  31 11.9 119
  42 2.3 23
  43 39 390
  44 4 40
  45 20.2 202
  46 1.4 14
  54 2.1 21
  56 2.3 23
  57 2.8 28
  58 5.1 51
  59 42.4 424
  60 2.8 28
  61 1.4 14
  69 6.1 61
  70 2.1 21
  71 3.4 34
  73 99.99 999
  74 7.8 78
  75 3.5 35
  81 1.7 17
  83 1.9 19
  84 2.8 28
  85 7.3 73
  86 2.1 21
  87 4.3 43
  97 1.1 11
  99 4.7 47
  100 1.8 18
  101 19 190
  102 8.6 86
  103 4 40
  113 1.5 15
  115 6.1 61
  116 86.7 867
  117 80 800
  118 16.1 161
  119 5.4 54
  121 1.5 15
  129 1.2 12
  131 2.9 29
  145 1.5 15
  157 1.2 12
  159 3.1 31
  160 3.7 37
  161 12.1 121
  162 3.2 32
  163 1.4 14
  175 2.3 23
  176 8.1 81
  177 1.8 18
  178 1.2 12