ACCESSION: MSBNK-Fac_Eng_Univ_Tokyo-JP012034
RECORD_TITLE: 1,2-DIBUTYL-1,2-DIMETHYLDISILANE (1,2-D2); EI-B; MS
DATE: 2016.01.19 (Created 2008.10.21, modified 2011.05.06)
AUTHORS: YAMAMOTO M, DEP. CHEMISTRY, FAC. SCIENCE, NARA WOMEN'S UNIV.
LICENSE: CC BY-NC-SA

CH$NAME: 1,2-DIBUTYL-1,2-DIMETHYLDISILANE (1,2-D2)
CH$COMPOUND_CLASS: N/A
CH$FORMULA: C10H26Si2
CH$EXACT_MASS: 202.15730
CH$SMILES: CCCC[Si]([2H])(C)[Si]([2H])(C)CCCC
CH$IUPAC: InChI=1S/C10H26Si2/c1-5-7-9-11(3)12(4)10-8-6-2/h11-12H,5-10H2,1-4H3/i11D,12D
CH$LINK: INCHIKEY NSYKINUQOKOVNW-USUSYXOVSA-N

AC$INSTRUMENT: HITACHI RMU-6M
AC$INSTRUMENT_TYPE: EI-B
AC$MASS_SPECTROMETRY: MS_TYPE MS
AC$MASS_SPECTROMETRY: ION_MODE POSITIVE
AC$MASS_SPECTROMETRY: IONIZATION_ENERGY 70 eV

MS$FOCUSED_ION: ION_TYPE [M]+*

PK$SPLASH: splash10-00di-9100000000-75396bd7ce558fb1b791
PK$NUM_PEAK: 49
PK$PEAK: m/z int. rel.int.
  27 6.7 67
  28 2 20
  29 10 100
  31 2.7 27
  39 2.7 27
  41 4 40
  43 38 380
  44 16.7 167
  45 28.7 287
  46 42 420
  47 4.7 47
  55 4.7 47
  56 2 20
  57 2.7 27
  58 14.7 147
  59 70 700
  60 40 400
  61 4 40
  69 2 20
  71 8 80
  72 99.99 999
  73 33.3 333
  74 20 200
  75 2.7 27
  76 2 20
  77 2 20
  85 15.3 153
  86 9.3 93
  87 8 80
  88 10.7 107
  89 8.7 87
  90 15.3 153
  91 18.7 187
  92 3.3 33
  99 2.7 27
  100 27.3 273
  101 20 200
  102 26.7 267
  103 5.3 53
  104 4 40
  105 3.3 33
  115 4 40
  118 1.3 13
  119 2 20
  122 1.3 13
  147 2.7 27
  204 17.3 173
  205 2.7 27
  206 1.3 13