ACCESSION: MSBNK-Fac_Eng_Univ_Tokyo-JP012173
RECORD_TITLE: CYCLOPENTANE; CI-B; MS
DATE: 2016.01.19 (Created 2008.10.21, modified 2011.05.06)
AUTHORS: IIDA Y, DAISHIMA S, FAC. OF ENGINEERING, SEIKEI UNIV.
LICENSE: CC BY-NC-SA

CH$NAME: CYCLOPENTANE
CH$COMPOUND_CLASS: N/A
CH$FORMULA: C5H10
CH$EXACT_MASS: 70.07825
CH$SMILES: C(C1)CCC1
CH$IUPAC: InChI=1S/C5H10/c1-2-4-5-3-1/h1-5H2
CH$LINK: CAS 287-92-3
CH$LINK: INCHIKEY RGSFGYAAUTVSQA-UHFFFAOYSA-N
CH$LINK: COMPTOX DTXSID6024886

AC$INSTRUMENT: FINNIGAN-MAT 4500
AC$INSTRUMENT_TYPE: CI-B
AC$MASS_SPECTROMETRY: MS_TYPE MS
AC$MASS_SPECTROMETRY: ION_MODE POSITIVE
AC$MASS_SPECTROMETRY: IONIZATION_ENERGY 120 eV
AC$MASS_SPECTROMETRY: REAGENT_GAS METHANE

PK$SPLASH: splash10-01b9-9000000000-44bf98018415e07534ce
PK$NUM_PEAK: 7
PK$PEAK: m/z int. rel.int.
  55 1.35 14
  57 2.46 25
  68 2.34 23
  69 99.99 999
  70 8.3 83
  71 51.15 512
  72 2.81 28