ACCESSION: MSBNK-Fac_Eng_Univ_Tokyo-JP012261
RECORD_TITLE: 1,2,4-TRIMETHYLBENZENE; CI-B; MS
DATE: 2016.01.19 (Created 2008.10.21, modified 2011.05.06)
AUTHORS: IIDA Y, DAISHIMA S, FAC. OF ENGINEERING, SEIKEI UNIV.
LICENSE: CC BY-NC-SA

CH$NAME: 1,2,4-TRIMETHYLBENZENE
CH$COMPOUND_CLASS: N/A
CH$FORMULA: C9H12
CH$EXACT_MASS: 120.09390
CH$SMILES: Cc(c1)cc(C)c(C)c1
CH$IUPAC: InChI=1S/C9H12/c1-7-4-5-8(2)9(3)6-7/h4-6H,1-3H3
CH$LINK: CAS 95-63-6
CH$LINK: INCHIKEY GWHJZXXIDMPWGX-UHFFFAOYSA-N
CH$LINK: COMPTOX DTXSID6021402

AC$INSTRUMENT: FINNIGAN-MAT 4500
AC$INSTRUMENT_TYPE: CI-B
AC$MASS_SPECTROMETRY: MS_TYPE MS
AC$MASS_SPECTROMETRY: ION_MODE POSITIVE
AC$MASS_SPECTROMETRY: IONIZATION_ENERGY 120 eV
AC$MASS_SPECTROMETRY: REAGENT_GAS METHANE

PK$SPLASH: splash10-00di-0900000000-95755809a6a91918193b
PK$NUM_PEAK: 8
PK$PEAK: m/z int. rel.int.
  57 1.06 11
  119 23.75 238
  120 10.17 102
  121 99.99 999
  122 9.44 94
  149 18.49 185
  150 2.19 22
  161 5.45 55