ACCESSION: MSBNK-Fac_Eng_Univ_Tokyo-JP012281
RECORD_TITLE: 1,2,3,4-TETRAMETHYLBENZENE; CI-B; MS
DATE: 2016.01.19 (Created 2008.10.21, modified 2011.05.06)
AUTHORS: IIDA Y, DAISHIMA S, FAC. OF ENGINEERING, SEIKEI UNIV.
LICENSE: CC BY-NC-SA

CH$NAME: 1,2,3,4-TETRAMETHYLBENZENE
CH$COMPOUND_CLASS: N/A
CH$FORMULA: C10H14
CH$EXACT_MASS: 134.10955
CH$SMILES: Cc(c1)c(C)c(C)c(C)c1
CH$IUPAC: InChI=1S/C10H14/c1-7-5-6-8(2)10(4)9(7)3/h5-6H,1-4H3
CH$LINK: CAS 488-23-3
CH$LINK: INCHIKEY UOHMMEJUHBCKEE-UHFFFAOYSA-N
CH$LINK: COMPTOX DTXSID4060072

AC$INSTRUMENT: FINNIGAN-MAT 4500
AC$INSTRUMENT_TYPE: CI-B
AC$MASS_SPECTROMETRY: MS_TYPE MS
AC$MASS_SPECTROMETRY: ION_MODE POSITIVE
AC$MASS_SPECTROMETRY: IONIZATION_ENERGY 120 eV
AC$MASS_SPECTROMETRY: REAGENT_GAS METHANE

PK$SPLASH: splash10-000i-0900000000-72f3f4dc86cbc594259e
PK$NUM_PEAK: 7
PK$PEAK: m/z int. rel.int.
  133 27.47 275
  134 10.39 104
  135 99.99 999
  136 11.08 111
  163 14.32 143
  164 2.09 21
  175 3.88 39