ACCESSION: MSBNK-Fac_Eng_Univ_Tokyo-JP012338
RECORD_TITLE: 1,2-DIMETHYLNAPHTHALENE; CI-B; MS
DATE: 2016.01.19 (Created 2008.10.21, modified 2011.05.06)
AUTHORS: IIDA Y, DAISHIMA S, FAC. OF ENGINEERING, SEIKEI UNIV.
LICENSE: CC BY-NC-SA

CH$NAME: 1,2-DIMETHYLNAPHTHALENE
CH$COMPOUND_CLASS: N/A
CH$FORMULA: C12H12
CH$EXACT_MASS: 156.09390
CH$SMILES: Cc(c1)c(C)c(c2)c(ccc2)c1
CH$IUPAC: InChI=1S/C12H12/c1-9-7-8-11-5-3-4-6-12(11)10(9)2/h3-8H,1-2H3
CH$LINK: CAS 573-98-8
CH$LINK: INCHIKEY QNLZIZAQLLYXTC-UHFFFAOYSA-N
CH$LINK: COMPTOX DTXSID1058717

AC$INSTRUMENT: FINNIGAN-MAT 4500
AC$INSTRUMENT_TYPE: CI-B
AC$MASS_SPECTROMETRY: MS_TYPE MS
AC$MASS_SPECTROMETRY: ION_MODE POSITIVE
AC$MASS_SPECTROMETRY: IONIZATION_ENERGY 120 eV
AC$MASS_SPECTROMETRY: REAGENT_GAS METHANE

PK$SPLASH: splash10-0a4i-0900000000-bf994e478622d19d1765
PK$NUM_PEAK: 7
PK$PEAK: m/z int. rel.int.
  155 5.06 51
  156 10.26 103
  157 99.99 999
  158 12.69 127
  185 17.55 176
  186 2.62 26
  197 3.83 38