ACCESSION: MSBNK-Fac_Eng_Univ_Tokyo-JP012362
RECORD_TITLE: ORTHO-TERPHENYL; CI-B; MS
DATE: 2016.01.19 (Created 2008.10.21, modified 2011.05.06)
AUTHORS: IIDA Y, DAISHIMA S, FAC. OF ENGINEERING, SEIKEI UNIV.
LICENSE: CC BY-NC-SA

CH$NAME: ORTHO-TERPHENYL
CH$COMPOUND_CLASS: N/A
CH$FORMULA: C18H14
CH$EXACT_MASS: 230.10955
CH$SMILES: c(c3)ccc(c3)c(c2)c(ccc2)c(c1)cccc1
CH$IUPAC: InChI=1S/C18H14/c1-3-9-15(10-4-1)17-13-7-8-14-18(17)16-11-5-2-6-12-16/h1-14H
CH$LINK: CAS 84-15-1
CH$LINK: INCHIKEY OIAQMFOKAXHPNH-UHFFFAOYSA-N
CH$LINK: COMPTOX DTXSID1049697

AC$INSTRUMENT: FINNIGAN-MAT 4500
AC$INSTRUMENT_TYPE: CI-B
AC$MASS_SPECTROMETRY: MS_TYPE MS
AC$MASS_SPECTROMETRY: ION_MODE POSITIVE
AC$MASS_SPECTROMETRY: IONIZATION_ENERGY 120 eV
AC$MASS_SPECTROMETRY: REAGENT_GAS METHANE

PK$SPLASH: splash10-001i-0090000000-90519c13095c7d9f14ef
PK$NUM_PEAK: 7
PK$PEAK: m/z int. rel.int.
  230 6.9 69
  231 99.99 999
  232 18.92 189
  233 1.7 17
  259 17.48 175
  260 3.77 38
  271 3.91 39