ACCESSION: MSBNK-NAIST-KNA00105
RECORD_TITLE: L-Tryptophan; LC-ESI-ITFT; MS; POS
DATE: 2016.01.19 (Created 2009.11.17, modified 2011.08.03)
AUTHORS: Takahashi H, Kanaya S, Ogasawara N, Graduate School of Information Science, NAIST
LICENSE: CC BY-SA

CH$NAME: L-Tryptophan
CH$NAME: Tryptophan
CH$NAME: (S)-alpha-Amino-beta-(3-indolyl)-propionic acid
CH$COMPOUND_CLASS: Natural Product
CH$FORMULA: C11H12N2O2
CH$EXACT_MASS: 204.08988
CH$SMILES: C1=CC=C2C(=C1)C(=CN2)C[C@@H](C(=O)O)N
CH$IUPAC: InChI=1S/C11H12N2O2/c12-9(11(14)15)5-7-6-13-10-4-2-1-3-8(7)10/h1-4,6,9,13H,5,12H2,(H,14,15)/t9-/m0/s1
CH$LINK: CAS 73-22-3
CH$LINK: CHEBI 16828
CH$LINK: KEGG C00078
CH$LINK: KNAPSACK C00001396
CH$LINK: NIKKAJI J9.181B
CH$LINK: PUBCHEM CID:6305
CH$LINK: INCHIKEY QIVBCDIJIAJPQS-VIFPVBQESA-N
CH$LINK: COMPTOX DTXSID5021419

AC$INSTRUMENT: LTQ Orbitrap XL, Thermo Scientfic
AC$INSTRUMENT_TYPE: LC-ESI-ITFT
AC$MASS_SPECTROMETRY: MS_TYPE MS
AC$MASS_SPECTROMETRY: ION_MODE POSITIVE
AC$MASS_SPECTROMETRY: COLLISION_ENERGY 35eV
AC$MASS_SPECTROMETRY: IONIZATION ESI
AC$CHROMATOGRAPHY: COLUMN_NAME TOSOH TSKgel ODS-100V 5um Part no. 21456
AC$CHROMATOGRAPHY: FLOW_GRADIENT 0min:3%, 45min:97%, 50min:97%, 50.1:3%, 57min:3% (acetonitrile)
AC$CHROMATOGRAPHY: FLOW_RATE 0.5 ml/min
AC$CHROMATOGRAPHY: RETENTION_TIME 13.954697 min
AC$CHROMATOGRAPHY: SOLVENT A 0.1%formate-water
AC$CHROMATOGRAPHY: SOLVENT B 0.1%formate-acetonitrile

MS$FOCUSED_ION: BASE_PEAK 205.096817

PK$SPLASH: splash10-0a4i-0290000000-5fa576241f151a3a01a2
PK$NUM_PEAK: 105
PK$PEAK: m/z int. rel.int.
  100.111848 195749.890625 3
  102.033553 224781.671875 3
  110.019746 427482.343750 7
  110.521485 33591.386719 1
  111.019815 86709.289063 1
  118.064726 58359.531250 1
  130.064906 82587.140625 1
  132.080388 199085.859375 3
  143.072629 99465.015625 2
  144.080628 272761.937500 4
  146.059807 732811.625000 11
  147.063208 33584.070313 1
  149.022904 83346.765625 1
  154.989704 32557.656250 1
  158.002552 70465.843750 1
  158.096003 61872.437500 1
  158.961247 61890.175781 1
  159.091551 385177.031250 6
  162.998158 40477.437500 1
  163.132671 178912.890625 3
  167.012526 45964.757813 1
  170.059836 117536.945313 2
  170.096285 85814.632813 1
  171.149125 1538057.875000 24
  172.152452 81392.757813 1
  173.078147 34512.117188 1
  174.127584 694130.812500 11
  175.130986 37467.386719 1
  179.063653 121178.476563 2
  182.984796 178095.703125 3
  185.114619 50874.449219 1
  186.956467 64679.699219 1
  187.126544 261773.078125 4
  188.025702 43332.464844 1
  188.057361 36787.453125 1
  188.059309 41266.449219 1
  188.062232 46628.316406 1
  188.064181 46500.527344 1
  188.066616 130613.085938 2
  188.070514 11688597.000000 182
  188.073437 121957.539063 2
  188.074898 131103.718750 2
  188.078309 50445.093750 1
  188.115341 41187.847656 1
  189.073687 1235793.000000 19
  190.076988 36637.964844 1
  190.992536 135981.375000 2
  199.180373 200807.875000 3
  204.247535 55370.730469 1
  204.816617 51872.164063 1
  204.943464 77962.492188 1
  205.003329 69456.687500 1
  205.045471 221400.875000 3
  205.051017 40367.765625 1
  205.052681 43099.558594 1
  205.067656 57919.371094 1
  205.070984 78478.289063 1
  205.073758 72091.343750 1
  205.076531 76939.140625 1
  205.079305 66281.640625 1
  205.082079 156116.734375 2
  205.083743 137504.890625 2
  205.087071 297362.312500 5
  205.089290 127243.406250 2
  205.092064 727079.375000 11
  205.097057 64211464.000000 999
  205.100386 656143.625000 10
  205.102051 761786.187500 12
  205.105379 258924.281250 4
  205.108709 143601.375000 2
  205.110928 186413.781250 3
  205.113147 81253.773438 1
  205.116477 81392.437500 1
  205.118696 65872.593750 1
  205.120916 66993.828125 1
  205.122025 73226.664063 1
  205.124245 37276.515625 1
  205.125355 55664.929688 1
  205.127575 34533.097656 1
  205.130904 33906.746094 1
  205.136454 38513.003906 1
  205.142003 48748.523438 1
  205.148108 234645.734375 4
  205.190295 75756.914063 1
  205.250267 82895.640625 1
  205.377518 65785.664063 1
  205.951332 50589.417969 1
  206.094882 117371.179688 2
  206.096559 48577.234375 1
  206.099353 7883630.000000 123
  206.103265 64922.292969 1
  206.104942 89065.851563 1
  207.102258 246238.437500 4
  283.173748 70692.250000 1
  300.200792 89714.718750 1
  305.155904 166931.109375 3
  375.237315 34580.945313 1
  391.282894 1161539.500000 18
  392.286254 196940.640625 3
  409.185630 721228.812500 11
  410.188058 72285.203125 1
  413.263556 45599.292969 1
  436.339497 34233.683594 1
  595.371480 327980.843750 5
  596.374294 100539.023438 2