ACCESSION: MSBNK-NAIST-KNA00129
RECORD_TITLE: L-Cysteine Sulfinic acid; LC-ESI-ITFT; MS; POS
DATE: 2016.01.19 (Created 2009.11.17, modified 2011.08.03)
AUTHORS: Takahashi H, Kanaya S, Ogasawara N, Graduate School of Information Science, NAIST
LICENSE: CC BY-SA
COMMENT: [Spectral] 3-Sulfino-L-alanine (exact mass = 153.00958) and sn-Glycerol 3-phosphate (exact mass = 172.01367) were not completely separated on HPLC under the present analytical conditions as described in "AC$XXX". Additionally some of the peaks in this data contains dimers and other unidentified ions.

CH$NAME: 3-Sulfino-L-alanine
CH$NAME: L-Cysteinesulfinic acid
CH$NAME: 3-Sulphino-L-alanine
CH$NAME: 3-Sulfinoalanine
CH$NAME: L-Cysteine Sulfinic acid
CH$COMPOUND_CLASS: Natural Product
CH$FORMULA: C3H7NO4S
CH$EXACT_MASS: 153.00958
CH$SMILES: N[C@H](C(O)=O)CS(O)=O
CH$IUPAC: InChI=1S/C3H7NO4S/c4-2(3(5)6)1-9(7)8/h2H,1,4H2,(H,5,6)(H,7,8)/t2-/m0/s1
CH$LINK: CAS 1115-65-7
CH$LINK: CHEBI 16345
CH$LINK: KEGG C00606
CH$LINK: NIKKAJI J36.785K
CH$LINK: PUBCHEM 3881
CH$LINK: INCHIKEY ADVPTQAUNPRNPO-REOHCLBHSA-N
CH$LINK: COMPTOX DTXSID20862546

AC$INSTRUMENT: LTQ Orbitrap XL, Thermo Scientfic
AC$INSTRUMENT_TYPE: LC-ESI-ITFT
AC$MASS_SPECTROMETRY: MS_TYPE MS
AC$MASS_SPECTROMETRY: ION_MODE POSITIVE
AC$MASS_SPECTROMETRY: COLLISION_ENERGY 35eV
AC$MASS_SPECTROMETRY: IONIZATION ESI
AC$CHROMATOGRAPHY: COLUMN_NAME TOSOH TSKgel ODS-100V 5um Part no. 21456
AC$CHROMATOGRAPHY: FLOW_GRADIENT 0min:3%, 45min:97%, 50min:97%, 50.1:3%, 57min:3% (acetonitrile)
AC$CHROMATOGRAPHY: FLOW_RATE 0.5 ml/min
AC$CHROMATOGRAPHY: RETENTION_TIME 6.749922 min
AC$CHROMATOGRAPHY: SOLVENT A 0.1%formate-water
AC$CHROMATOGRAPHY: SOLVENT B 0.1%formate-acetonitrile

MS$FOCUSED_ION: BASE_PEAK 154.016632

PK$SPLASH: splash10-0udi-0901000000-8b2d25e84579e5f8aab5
PK$NUM_PEAK: 391
PK$PEAK: m/z int. rel.int.
  100.110334 4976.517090 1
  100.111848 289390.000000 53
  100.113740 2737.187744 1
  101.095699 19989.728516 4
  101.115285 6556.014160 1
  102.012921 6773.638184 1
  102.033553 126209.335938 23
  102.091007 9170.230469 2
  107.069996 16606.919922 3
  108.011154 8853.047852 2
  109.021948 4614.346680 1
  110.019746 197759.640625 36
  110.020836 3636.999268 1
  110.521266 4473.403809 1
  111.019815 43572.078125 8
  112.017456 6412.679688 1
  113.059253 5189.389160 1
  113.963374 25943.716797 5
  114.127166 3306.248535 1
  115.111540 4682.193848 1
  116.998316 5228.026367 1
  117.981172 3398.707031 1
  122.963604 7770.729492 1
  125.985947 3372.276367 1
  126.500624 2802.763428 1
  126.987102 2897.022461 1
  128.018019 3347.076172 1
  128.106709 44558.832031 8
  128.950559 3336.956055 1
  129.127203 25470.820313 5
  130.007768 7905.900391 1
  130.031571 2849.950195 1
  130.122642 4857.533203 1
  130.158817 19774.869141 4
  130.491545 10335.003906 2
  130.508722 4741.786621 1
  130.517453 4903.063965 1
  133.079206 61717.472656 11
  134.039259 7494.725098 1
  134.486797 5417.590332 1
  136.000082 3081.197266 1
  136.000981 3393.846680 1
  136.003677 4217.446777 1
  136.006074 370208.468750 68
  136.008171 3510.941406 1
  136.009070 4262.218750 1
  136.021055 5243.314453 1
  137.132305 86783.718750 16
  137.511942 26453.984375 5
  138.001800 3221.276123 1
  138.135405 3387.558105 1
  138.494895 13460.023438 2
  139.982321 3369.537109 1
  140.010480 97791.875000 18
  141.958490 85617.273438 16
  142.122204 3887.135986 1
  143.039341 45958.878906 8
  144.981860 2855.274658 1
  149.020499 3885.226807 1
  149.023248 308525.968750 57
  149.024966 4679.371582 1
  149.025653 2794.539307 1
  149.026341 3249.744141 1
  150.026498 15164.338867 3
  151.096730 37675.968750 7
  153.463412 3891.886475 1
  153.835025 3927.103760 1
  153.916868 8695.891602 2
  153.955829 4635.439941 1
  153.983255 17583.232422 3
  153.988669 2916.309814 1
  153.991917 3215.883545 1
  153.992639 3451.029053 1
  153.994805 3832.380615 1
  153.999497 4172.949219 1
  154.000580 5150.008789 1
  154.002385 3498.218506 1
  154.003468 5689.487793 1
  154.004551 7121.886230 1
  154.005995 11648.611328 2
  154.007078 14266.549805 3
  154.008161 16899.445313 3
  154.010327 25147.628906 5
  154.011410 9943.871094 2
  154.013576 67212.804688 12
  154.016464 5449802.000000 999
  154.018992 58349.046875 11
  154.020075 59318.667969 11
  154.021519 17673.914063 3
  154.022602 17226.230469 3
  154.023324 15071.523438 3
  154.024407 11664.577148 2
  154.025852 19335.519531 4
  154.026935 9965.079102 2
  154.028018 9460.034180 2
  154.029462 7625.647949 1
  154.031629 3835.097900 1
  154.033434 7972.514648 1
  154.037406 2743.432861 1
  154.038129 3609.462158 1
  154.040295 4098.816406 1
  154.041017 4121.948242 1
  154.042462 3219.782715 1
  154.043906 3028.430176 1
  154.045351 3669.553467 1
  154.050046 17940.027344 3
  154.077136 5732.516113 1
  154.116519 8529.759766 2
  154.198586 4481.658203 1
  154.572875 3917.641846 1
  154.989704 21802.343750 4
  154.999909 3397.417236 1
  155.013761 7783.603516 1
  155.015584 23491.027344 4
  155.019958 154280.000000 28
  155.023240 2792.237305 1
  155.142526 84018.687500 15
  156.012310 209676.281250 38
  156.020408 23015.847656 4
  156.145638 3432.469238 1
  158.002552 23227.496094 4
  158.096003 96795.039063 18
  158.960868 8315.521484 2
  159.099132 6387.968750 1
  159.112399 17324.205078 3
  161.110293 3260.174561 1
  163.129523 5168.450195 1
  163.132671 368826.875000 68
  163.134639 5997.861328 1
  163.136607 3474.574707 1
  164.136124 5352.549805 1
  166.018172 8035.853516 1
  167.012526 4933.652832 1
  167.017418 4896.062500 1
  167.033727 50547.113281 9
  168.013372 144830.093750 27
  168.122845 6551.925781 1
  168.174738 2881.441406 1
  169.012866 4882.130859 1
  170.011674 32277.759766 6
  170.096285 116703.117188 21
  170.981350 2814.979004 1
  171.005423 53891.722656 10
  171.100077 4651.814941 1
  171.110223 4344.473633 1
  171.135170 2817.625000 1
  171.136438 2848.056641 1
  171.138553 84627.632813 16
  171.141936 5215.627441 1
  171.142782 3508.432373 1
  171.144473 7741.434570 1
  171.145742 18633.339844 3
  171.149125 1604527.250000 294
  171.151240 18461.990234 3
  171.152932 15741.364258 3
  171.155892 5485.827148 1
  171.159699 4134.323730 1
  171.188041 3871.958252 1
  171.992572 4867.392090 1
  172.111502 3432.379395 1
  172.140933 5061.572266 1
  172.152452 138528.437500 25
  172.169092 9292.175781 2
  172.956066 7781.941406 1
  172.976690 112394.476563 21
  172.981417 2782.390137 1
  173.010643 3036.252197 1
  173.013222 3074.289063 1
  173.017520 11099.145508 2
  173.020959 975219.250000 179
  173.023538 10132.128906 2
  173.024828 9836.494141 2
  173.026548 3159.698730 1
  173.027837 3118.928467 1
  173.031707 2921.353760 1
  173.077717 13138.790039 2
  174.023903 13706.782227 3
  174.124112 5851.381836 1
  174.127584 492329.500000 90
  174.131490 3954.408936 1
  175.035155 2739.822266 1
  175.089406 74361.734375 14
  175.130548 37570.699219 7
  176.092758 2999.581055 1
  176.142644 4599.193848 1
  178.034839 11934.295898 2
  179.063653 159910.515625 29
  180.032950 3068.063965 1
  180.066262 6660.061523 1
  180.158947 29495.675781 5
  180.989441 4332.376465 1
  181.032220 4606.886230 1
  181.979075 3555.885986 1
  181.987885 3387.248047 1
  182.028700 135518.203125 25
  182.189309 3046.522217 1
  182.984796 201060.296875 37
  183.028285 2897.587646 1
  183.032494 3330.186768 1
  184.025752 2983.151123 1
  184.985290 2908.765869 1
  185.114144 15822.958008 3
  186.184865 49060.484375 9
  187.120742 2939.510254 1
  187.122192 6601.256836 1
  187.126060 649409.187500 119
  187.129445 6269.248535 1
  187.130895 6788.544434 1
  187.187964 3160.643799 1
  188.128987 32102.798828 6
  188.130937 3332.621094 1
  188.142635 3363.660889 1
  189.121330 6966.747070 1
  190.046798 12949.499023 2
  193.929107 14268.683594 3
  194.116962 19324.968750 4
  194.174190 4000.631592 1
  195.002212 41352.308594 8
  195.086593 9638.274414 2
  195.122110 30107.410156 6
  196.007514 15545.916992 3
  196.153765 4583.758789 1
  199.180373 261205.156250 48
  200.183421 13133.960938 2
  206.952593 3610.039795 1
  207.093814 3126.553467 1
  208.068843 2756.722412 1
  208.190213 17718.556641 3
  213.158720 3148.827881 1
  214.002399 8536.223633 2
  215.157172 5204.499023 1
  216.205980 5237.164551 1
  217.104082 17026.384766 3
  218.983245 2949.028320 1
  220.111375 95700.390625 18
  221.114659 9812.441406 2
  223.063237 167711.609375 31
  223.066384 3670.488525 1
  223.131214 3206.947510 1
  224.062086 9494.428711 2
  224.947806 3304.000732 1
  225.059369 5932.153809 1
  225.195268 2916.701172 1
  226.158371 11569.776367 2
  228.231451 18569.462891 3
  229.973734 6449.078125 1
  232.169093 7132.373535 1
  232.989800 6593.501953 1
  233.173966 100953.531250 19
  233.177329 3793.927002 1
  234.177254 4563.242188 1
  234.955572 13434.737305 2
  235.167956 5152.251465 1
  239.933898 4365.586914 1
  240.106682 3305.266846 1
  240.179082 4099.735352 1
  242.984054 6072.222656 1
  244.237292 9032.165039 2
  247.979009 11850.360352 2
  248.962187 131545.531250 24
  249.965405 3580.124023 1
  250.199964 9096.922852 2
  251.993143 5160.827637 1
  255.155217 4185.978516 1
  256.262765 5299.520020 1
  256.962344 9185.765625 2
  259.225713 3365.231689 1
  261.167989 4658.915039 1
  261.984653 9794.399414 2
  261.988658 2847.034668 1
  264.130698 8530.164063 2
  267.965785 27047.486328 5
  267.969099 4281.871094 1
  268.080989 3176.688965 1
  271.936670 4608.635742 1
  274.157534 3828.870361 1
  277.199902 33474.453125 6
  277.203389 3347.753662 1
  278.203372 4033.805420 1
  278.231421 6347.623535 1
  279.158552 67554.898438 12
  279.162076 7205.455078 1
  280.161171 10966.839844 2
  280.164715 3178.746582 1
  282.220291 72053.500000 13
  282.224768 7073.693359 1
  283.223259 6534.841309 1
  291.905055 3363.658936 1
  294.225799 12651.500000 2
  299.181639 23836.087891 4
  299.185549 2853.073730 1
  305.194169 6599.145020 1
  307.025165 20471.113281 4
  307.028214 5703.398438 1
  307.974410 3819.842529 1
  308.241029 3402.033447 1
  308.991662 3312.767578 1
  320.293539 6105.579102 1
  321.225628 5746.900879 1
  322.220780 5373.716797 1
  322.257928 12217.456055 2
  323.019796 4889.482910 1
  324.013388 14406.756836 3
  324.914201 3184.936279 1
  326.021046 3608.542725 1
  326.029941 500765.250000 92
  326.037725 3416.524170 1
  326.041061 4322.628418 1
  327.031880 10713.871094 2
  327.176029 6332.849121 1
  328.024977 8180.252930 1
  334.933652 3171.804688 1
  338.252048 6382.777344 1
  343.016085 4268.220215 1
  343.206958 5810.782227 1
  343.210561 3107.658203 1
  344.936852 4272.918457 1
  345.033677 28764.730469 5
  346.938481 4153.515625 1
  350.251546 2799.979492 1
  352.043775 2781.279053 1
  359.935616 3912.897217 1
  360.942502 2932.939697 1
  365.941686 4244.887207 1
  371.202105 3967.318604 1
  378.939879 2758.211914 1
  379.947863 8483.363281 2
  382.970584 3224.246826 1
  391.148429 2737.576660 1
  391.244886 3295.286865 1
  391.249271 3279.425537 1
  391.258042 3792.674561 1
  391.266813 5121.335449 1
  391.271198 12086.568359 2
  391.282894 1606281.000000 294
  391.293128 13002.376953 2
  391.297514 12239.565430 2
  391.303362 5153.885254 1
  391.306286 3049.700195 1
  391.320907 3498.020264 1
  391.418890 2937.318848 1
  392.273046 2800.400635 1
  392.286254 383416.843750 70
  392.296527 3001.065918 1
  393.289058 26304.500000 5
  398.950586 2917.271484 1
  413.263556 25461.080078 5
  414.266682 6365.306641 1
  419.311567 4496.354004 1
  422.323179 16814.458984 3
  426.355027 25106.277344 5
  426.363342 2823.447510 1
  427.352820 2996.210449 1
  427.359495 3802.749268 1
  427.376183 9054.825195 2
  434.323630 3352.485596 1
  435.164302 3898.586182 1
  436.341219 191393.953125 35
  437.163587 3231.429688 1
  437.343196 35147.277344 6
  438.916035 6974.407227 1
  452.933076 4723.270996 1
  456.928514 57594.035156 11
  457.931932 3009.247559 1
  461.933829 5555.196777 1
  464.370027 27693.921875 5
  465.373418 5020.011719 1
  470.942922 9460.365234 2
  475.379199 10268.411133 2
  478.349236 25399.039063 5
  478.357140 5528.149414 1
  479.352704 4758.507324 1
  479.943988 4652.270020 1
  484.921577 5254.151367 1
  484.957885 4088.367920 1
  490.386985 8304.878906 2
  493.959029 6739.904297 1
  498.042274 7743.595703 1
  498.937825 4923.185059 1
  502.959496 2884.672607 1
  507.936930 4226.932617 1
  544.288590 9529.522461 2
  545.292554 3513.961914 1
  591.926356 4960.833984 1
  592.920475 4119.486328 1
  690.896823 2727.633789 1
  798.585172 5443.829102 1
  803.539991 3238.096924 1
  804.543384 3268.479248 1
  1221.995860 4969.189941 1
  1321.992409 5035.304688 1