ACCESSION: MSBNK-NAIST-KNA00400
RECORD_TITLE: NADP+; LC-ESI-ITFT; MS; POS
DATE: 2016.01.19 (Created 2009.11.18, modified 2011.08.03)
AUTHORS: Takahashi H, Kanaya S, Ogasawara N, Graduate School of Information Science, NAIST
LICENSE: CC BY-SA

CH$NAME: NADP+
CH$NAME: NADP
CH$NAME: Nicotinamide adenine dinucleotide phosphate
CH$NAME: beta-Nicotinamide adenine dinucleotide phosphate
CH$NAME: TPN
CH$NAME: Triphosphopyridine nucleotide
CH$COMPOUND_CLASS: Natural Product
CH$FORMULA: C21H29N7O17P3+
CH$EXACT_MASS: 744.08328
CH$SMILES: NC(=O)c(c5)c[n+1](cc5)[C@H](O1)[C@H](O)[C@H](O)[C@@H](COP(O)(=O)OP(O)(=O)OC[C@@H](O2)[C@@H](O)[C@@H](OP(O)(O)=O)[C@@H]2n(c3)c(n4)c(c(N)nc4)n3)1
CH$IUPAC: InChI=1S/C21H28N7O17P3/c22-17-12-19(25-7-24-17)28(8-26-12)21-16(44-46(33,34)35)14(30)11(43-21)6-41-48(38,39)45-47(36,37)40-5-10-13(29)15(31)20(42-10)27-3-1-2-9(4-27)18(23)32/h1-4,7-8,10-11,13-16,20-21,29-31H,5-6H2,(H7-,22,23,24,25,32,33,34,35,36,37,38,39)/p+1/t10-,11-,13-,14-,15-,16-,20-,21-/m1/s1
CH$LINK: CAS 53-59-8
CH$LINK: CHEBI 18009
CH$LINK: KEGG C00006
CH$LINK: NIKKAJI J247.824B
CH$LINK: PUBCHEM CID:5886
CH$LINK: INCHIKEY XJLXINKUBYWONI-NNYOXOHSSA-O

AC$INSTRUMENT: LTQ Orbitrap XL, Thermo Scientfic
AC$INSTRUMENT_TYPE: LC-ESI-ITFT
AC$MASS_SPECTROMETRY: MS_TYPE MS
AC$MASS_SPECTROMETRY: ION_MODE POSITIVE
AC$MASS_SPECTROMETRY: COLLISION_ENERGY 35eV
AC$MASS_SPECTROMETRY: IONIZATION ESI
AC$CHROMATOGRAPHY: COLUMN_NAME TOSOH TSKgel ODS-100V 5um Part no. 21456
AC$CHROMATOGRAPHY: FLOW_GRADIENT 0min:3%, 45min:97%, 50min:97%, 50.1:3%, 57min:3% (acetonitrile)
AC$CHROMATOGRAPHY: FLOW_RATE 0.5 ml/min
AC$CHROMATOGRAPHY: RETENTION_TIME 8.862515 min
AC$CHROMATOGRAPHY: SOLVENT A 0.1%formate-water
AC$CHROMATOGRAPHY: SOLVENT B 0.1%formate-acetonitrile

MS$FOCUSED_ION: BASE_PEAK 372.544983

PK$SPLASH: splash10-00dl-0209000700-f79d2a9376be7f2976f7
PK$NUM_PEAK: 285
PK$PEAK: m/z int. rel.int.
  100.111848 40083.148438 1
  101.095891 18399.621094 1
  107.069996 260082.437500 9
  123.031368 24709.644531 1
  123.051218 40202.687500 1
  123.053280 102077.843750 4
  123.055343 6314651.000000 223
  123.057148 121537.539063 4
  123.058695 37502.347656 1
  123.079067 20302.896484 1
  124.052231 18045.441406 1
  124.058233 278877.750000 10
  127.766140 14837.294922 1
  129.127203 24674.246094 1
  136.061516 223076.187500 8
  137.132002 57202.058594 2
  149.022904 101887.851563 4
  155.142891 52908.582031 2
  158.096003 26439.568359 1
  163.132671 130557.492188 5
  167.033727 15319.658203 1
  170.096285 50596.164063 2
  171.137707 30837.152344 1
  171.149125 878721.250000 31
  172.152025 39327.019531 1
  174.127584 371037.968750 13
  175.089843 15725.376953 1
  175.130986 18644.013672 1
  179.063653 33377.464844 1
  186.185345 14163.164063 1
  187.126060 279079.875000 10
  188.129475 19113.724609 1
  190.990043 16501.105469 1
  190.992536 23662.355469 1
  195.122110 14336.153320 1
  199.059899 19749.513672 1
  199.179842 123767.375000 4
  207.026280 16944.458984 1
  220.111375 16144.179688 1
  222.112313 327901.343750 12
  223.063237 185057.328125 7
  223.115476 18812.275391 1
  224.123549 14551.546875 1
  224.127985 1102318.625000 39
  224.133055 14732.240234 1
  225.131450 86795.242188 3
  233.173966 24490.011719 1
  277.200773 15684.875000 1
  282.220291 14505.423828 1
  307.083094 19291.472656 1
  332.561263 24455.640625 1
  333.054384 17168.367188 1
  335.063363 71496.875000 3
  348.070300 20696.808594 1
  363.540462 380962.093750 13
  364.042427 43230.441406 2
  364.064731 15833.099609 1
  370.468325 24102.750000 1
  371.839180 17065.060547 1
  372.169860 22759.207031 1
  372.308226 18387.708984 1
  372.419517 63763.019531 2
  372.481970 22775.458984 1
  372.488760 25015.984375 1
  372.491476 23650.267578 1
  372.496907 16836.671875 1
  372.499623 18871.636719 1
  372.505055 32208.320313 1
  372.510487 27533.910156 1
  372.513203 21293.490234 1
  372.515919 22371.693359 1
  372.518635 29236.251953 1
  372.524067 118315.625000 4
  372.529500 109323.296875 4
  372.533574 260754.656250 9
  372.544440 28262174.000000 999
  372.555305 330708.718750 12
  372.563455 107193.359375 4
  372.568888 49214.050781 2
  372.571605 30949.300781 1
  372.574322 28311.998047 1
  372.577038 23086.216797 1
  372.582472 27975.378906 1
  372.587906 24763.585938 1
  372.596056 27463.699219 1
  372.602849 17729.818359 1
  372.606924 18600.625000 1
  372.609642 17755.705078 1
  372.627303 15143.986328 1
  372.669425 56797.769531 2
  372.780878 20570.580078 1
  373.025707 20311.429688 1
  373.029790 28482.947266 1
  373.035233 74408.906250 3
  373.046120 7492413.000000 265
  373.057008 84526.976563 3
  373.063813 27038.511719 1
  373.069257 18394.576172 1
  373.171359 14559.367188 1
  373.253070 23276.679688 1
  373.536542 20921.707031 1
  373.546088 1752012.875000 62
  373.556998 14538.888672 1
  374.047061 188631.140625 7
  374.549043 15242.746094 1
  374.639425 26428.648438 1
  383.534619 34041.082031 1
  391.282894 530019.187500 19
  391.516910 39323.882813 1
  392.286254 60195.699219 2
  394.502835 99135.078125 4
  395.003562 37773.667969 1
  399.000260 32739.523438 1
  399.503544 102177.835938 4
  400.006268 22209.095703 1
  402.509776 21645.207031 1
  403.010547 33532.437500 1
  403.507659 422899.906250 15
  404.008760 96201.039063 3
  404.504648 15785.583984 1
  404.510795 18712.169922 1
  422.002057 27405.968750 1
  426.356690 28534.583984 1
  428.036131 334253.906250 12
  429.038156 19398.589844 1
  439.517610 68006.507813 2
  440.019286 16398.630859 1
  447.534195 16876.263672 1
  475.379199 19868.623047 1
  504.375045 17011.619141 1
  508.001804 115487.757813 4
  509.004612 14635.330078 1
  511.027885 85420.242188 3
  511.361902 38790.824219 1
  511.694060 28021.037109 1
  512.030919 16214.865234 1
  514.026053 16939.615234 1
  514.363014 34809.164063 1
  517.032918 15208.523438 1
  560.077597 15404.191406 1
  567.680033 18175.636719 1
  568.183659 16346.496094 1
  604.023088 114154.390625 4
  605.025361 16953.005859 1
  622.033630 205735.468750 7
  623.037019 25380.062500 1
  640.044486 14541.050781 1
  664.112670 30647.994141 1
  665.096491 27574.919922 1
  675.954792 18936.693359 1
  738.229263 16218.746094 1
  743.726797 35394.468750 1
  743.933717 15818.554688 1
  743.968212 15159.289063 1
  743.991210 16028.736328 1
  744.006543 18591.527344 1
  744.021876 69892.476563 2
  744.037209 64122.222656 2
  744.052543 144498.921875 5
  744.083213 22079746.000000 780
  744.113884 171227.968750 6
  744.133055 62729.769531 2
  744.148392 34353.941406 1
  744.156060 26913.693359 1
  744.163729 15787.521484 1
  744.186736 25298.585938 1
  744.202075 23140.533203 1
  744.436048 32146.964844 1
  744.524296 14792.378906 1
  744.554995 32915.914063 1
  744.581857 4332806.000000 153
  744.612560 32745.121094 1
  744.746904 15057.320313 1
  745.038749 20327.822266 1
  745.054114 35094.929688 1
  745.084845 4908365.000000 173
  745.115578 40226.371094 1
  745.138630 21121.130859 1
  745.584497 413571.437500 15
  746.088501 703141.375000 25
  747.090330 71136.234375 3
  750.003190 18015.988281 1
  755.072281 73313.070313 3
  755.574169 24878.189453 1
  756.060850 24774.814453 1
  758.390853 21515.132813 1
  758.718387 96113.242188 3
  759.054033 48412.824219 2
  759.385949 54371.265625 2
  759.722037 28917.673828 1
  761.719439 14919.056641 1
  762.057078 36131.406250 1
  762.386990 23175.242188 1
  762.721095 23954.673828 1
  763.055419 22117.781250 1
  764.722354 30004.144531 1
  765.057995 30343.433594 1
  765.389857 29848.416016 1
  765.541866 17153.130859 1
  766.038211 128328.625000 5
  766.539048 49566.535156 2
  770.535200 40096.753906 1
  771.040454 74345.656250 3
  771.542157 48759.191406 2
  772.040298 19920.779297 1
  774.546397 27859.421875 1
  775.043375 236555.406250 8
  775.544911 167292.671875 6
  776.046934 51574.546875 2
  776.545357 23294.242188 1
  806.006616 31805.554688 1
  886.424610 53980.593750 2
  886.758695 38822.234375 1
  887.092970 42829.800781 2
  887.427433 20703.449219 1
  957.594381 36773.695313 1
  958.602670 18293.810547 1
  991.775081 1127466.125000 40
  992.105537 1196183.375000 42
  992.442063 698629.937500 25
  992.778761 276059.531250 10
  993.109719 126073.570313 4
  993.446756 54621.644531 2
  999.101334 31179.617188 1
  999.435459 27090.595703 1
  999.769751 16229.234375 1
  1004.756200 22350.375000 1
  1006.412570 14384.158203 1
  1006.744336 14207.272461 1
  1007.082302 15585.910156 1
  1009.410434 20638.056641 1
  1009.743683 35919.156250 1
  1010.083161 27188.414063 1
  1010.410677 16433.035156 1
  1012.081055 18550.718750 1
  1012.415628 77174.640625 3
  1012.750366 47546.070313 2
  1013.085271 63674.144531 2
  1013.420342 23061.068359 1
  1013.749482 18866.560547 1
  1115.621225 875076.375000 31
  1115.670496 17342.425781 1
  1115.867609 130675.320313 5
  1116.121118 698022.625000 25
  1116.374713 53246.128906 2
  1116.621346 334315.718750 12
  1117.121911 84997.468750 3
  1117.629870 25399.951172 1
  1131.347399 23618.863281 1
  1131.606201 15999.861328 1
  1134.790970 14534.058594 1
  1146.586668 35001.531250 1
  1147.085504 23601.896484 1
  1147.592009 18157.201172 1
  1190.124515 16032.093750 1
  1239.472255 151370.187500 5
  1239.802016 199566.421875 7
  1240.131908 176703.703125 6
  1240.470185 94682.351563 3
  1240.808599 46052.585938 2
  1241.138894 18450.144531 1
  1260.439413 21259.546875 1
  1260.777577 17252.292969 1
  1301.639196 50757.734375 2
  1301.887596 68657.468750 2
  1302.144944 49086.578125 2
  1302.393489 30253.648438 1
  1302.642106 20471.253906 1
  1316.877635 14790.111328 1
  1338.746497 24590.871094 1
  1339.153686 19055.414063 1
  1487.165073 121990.320313 4
  1487.414256 27483.632813 1
  1487.500943 65628.281250 2
  1487.555126 20473.519531 1
  1487.663501 85536.859375 3
  1487.771889 15995.029297 1
  1487.826087 69828.273438 2
  1487.923650 36934.035156 1
  1488.162180 120819.375000 4
  1488.411614 22377.650391 1
  1488.498388 18641.888672 1
  1488.671959 29960.281250 1
  1488.823858 15265.214844 1
  1489.171145 16712.839844 1