ACCESSION: MSBNK-NAIST-KNA00511
RECORD_TITLE: L-Carnosine; LC-ESI-ITFT; MS; NEG
DATE: 2016.01.19 (Created 2009.11.18, modified 2011.08.03)
AUTHORS: Takahashi H, Kanaya S, Ogasawara N, Graduate School of Information Science, NAIST
LICENSE: CC BY-SA

CH$NAME: Carnosine
CH$NAME: Nalpha-(beta-alanyl)-L-histidine
CH$NAME: L-Carnosine
CH$COMPOUND_CLASS: Natural Product
CH$FORMULA: C9H14N4O3
CH$EXACT_MASS: 226.10659
CH$SMILES: C1=C(NC=N1)C[C@@H](C(=O)O)NC(=O)CCN
CH$IUPAC: InChI=1S/C9H14N4O3/c10-2-1-8(14)13-7(9(15)16)3-6-4-11-5-12-6/h4-5,7H,1-3,10H2,(H,11,12)(H,13,14)(H,15,16)/t7-/m0/s1
CH$LINK: CAS 305-84-0
CH$LINK: CHEBI 15727
CH$LINK: KEGG C00386
CH$LINK: NIKKAJI J5.496H
CH$LINK: PUBCHEM 3676
CH$LINK: INCHIKEY CQOVPNPJLQNMDC-ZETCQYMHSA-N
CH$LINK: COMPTOX DTXSID80879594

AC$INSTRUMENT: LTQ Orbitrap XL, Thermo Scientfic
AC$INSTRUMENT_TYPE: LC-ESI-ITFT
AC$MASS_SPECTROMETRY: MS_TYPE MS
AC$MASS_SPECTROMETRY: ION_MODE NEGATIVE
AC$MASS_SPECTROMETRY: COLLISION_ENERGY 35eV
AC$MASS_SPECTROMETRY: IONIZATION ESI
AC$CHROMATOGRAPHY: COLUMN_NAME TOSOH TSKgel ODS-100V 5um Part no. 21456
AC$CHROMATOGRAPHY: FLOW_GRADIENT 0min:3%, 45min:97%, 50min:97%, 50.1:3%, 57min:3% (acetonitrile)
AC$CHROMATOGRAPHY: FLOW_RATE 0.5 ml/min
AC$CHROMATOGRAPHY: RETENTION_TIME 3.941245 min
AC$CHROMATOGRAPHY: SOLVENT A 0.1%formate-water
AC$CHROMATOGRAPHY: SOLVENT B 0.1%formate-acetonitrile

MS$FOCUSED_ION: BASE_PEAK 225.098022

PK$SPLASH: splash10-004i-0490200000-e7a68540cb7eb6b88020
PK$NUM_PEAK: 325
PK$PEAK: m/z int. rel.int.
  108.056806 8805.739258 3
  109.040948 1724.755249 1
  110.011996 2837.013916 1
  110.052337 6580.726074 2
  110.059972 1687.893555 1
  110.062590 1685.009277 1
  110.064990 2333.282227 1
  110.065862 2508.444336 1
  110.066735 6766.244141 2
  110.068917 11409.896484 4
  110.070444 43049.472656 14
  110.072407 1081959.875000 356
  110.074153 44661.773438 15
  110.075244 8254.085938 3
  110.076117 10915.026367 4
  110.076771 2922.203125 1
  110.077862 6315.178223 2
  110.080044 1909.513306 1
  110.082226 1586.921021 1
  110.084627 1895.180298 1
  110.092483 6765.000000 2
  110.132869 2861.359619 1
  111.069238 6056.061035 2
  111.073882 1961.551880 1
  111.075652 41454.867188 14
  112.985648 40204.765625 13
  127.051039 21903.562500 7
  137.035575 18345.869141 6
  139.006887 4148.768066 1
  145.061725 2467.001465 1
  152.082798 8015.377930 3
  154.053097 1584.048340 1
  154.057070 3656.442383 1
  154.058877 11627.300781 4
  154.062128 354812.468750 117
  154.065019 12309.621094 4
  154.066825 1905.628052 1
  154.068270 3081.746338 1
  154.095371 1781.398315 1
  155.059019 2795.593018 1
  155.065221 19132.681641 6
  161.082882 1779.238403 1
  163.098549 22661.345703 7
  163.991178 2449.651367 1
  164.082472 23436.371094 8
  179.093746 2324.861572 1
  181.105649 4802.536621 2
  181.109333 183414.328125 60
  181.113477 5469.625977 2
  182.112265 7846.242188 3
  187.994094 5384.702148 2
  207.088163 8472.049805 3
  215.989187 6131.982910 2
  224.803964 1858.845825 1
  224.921182 5635.161621 2
  224.928830 1540.089844 1
  225.001504 1750.752319 1
  225.023186 1820.576294 1
  225.027650 1679.730713 1
  225.039130 13992.542969 5
  225.043595 2334.309814 1
  225.046146 1776.401733 1
  225.059541 2648.933838 1
  225.061455 4042.041748 1
  225.069748 2959.188965 1
  225.076765 5142.323242 2
  225.079317 5528.099609 2
  225.081869 12746.416992 4
  225.084421 6851.998535 2
  225.087611 23243.695313 8
  225.092715 86929.835938 29
  225.097820 3040407.250000 999
  225.103562 88798.671875 29
  225.106753 18745.134766 6
  225.108667 21984.419922 7
  225.114410 13763.778320 5
  225.116963 5471.988770 2
  225.120153 3782.023682 1
  225.124620 2352.344238 1
  225.126535 3919.994873 1
  225.132279 3010.297607 1
  225.134193 3365.799316 1
  225.136108 3373.884033 1
  225.143767 2265.438721 1
  225.151426 1780.746704 1
  225.156532 13448.930664 4
  225.159724 1805.714722 1
  225.162277 1894.265015 1
  225.168661 2377.668701 1
  225.175044 1546.683350 1
  225.195474 1669.499634 1
  225.274665 5506.695801 2
  225.392252 1649.289795 1
  226.090075 3228.707031 1
  226.092644 1573.209839 1
  226.095856 33158.105469 11
  226.101636 258405.968750 85
  226.107417 6666.671387 2
  227.098604 3605.553467 1
  227.102483 12331.978516 4
  228.106085 1530.818237 1
  230.997193 1568.580566 1
  232.020074 3870.016357 1
  233.012128 8018.330078 3
  233.999061 1910.908813 1
  234.020027 9309.531250 3
  235.028353 7110.175293 2
  249.056295 3125.353271 1
  257.999226 4197.278320 1
  261.075238 2024.290649 1
  267.060362 2147.213867 1
  267.067784 91459.367188 30
  267.074380 2160.536133 1
  268.002006 2594.312988 1
  268.070819 5137.042480 2
  269.062838 11472.287109 4
  278.010281 3441.747803 1
  279.018405 5075.519531 2
  280.025825 2195.683105 1
  281.033371 3825.259033 1
  285.030215 3936.454346 1
  285.077497 1680.889648 1
  286.030182 3056.012939 1
  287.026233 43696.832031 14
  288.029342 2480.045654 1
  288.094001 7146.107422 2
  289.021938 3130.225342 1
  292.025992 1821.044800 1
  293.085782 1792.720581 1
  295.061805 9952.609375 3
  297.027896 2390.834961 1
  305.036724 6495.272461 2
  309.050726 2989.808838 1
  311.007182 2304.961914 1
  313.072261 3581.186035 1
  314.994198 4153.161621 1
  315.068146 2398.271484 1
  316.991459 1717.247437 1
  320.020994 2919.656494 1
  323.065640 19095.238281 6
  323.075514 4206.516113 1
  325.022901 11708.581055 4
  325.183485 1580.339722 1
  333.031401 9395.099609 3
  339.051618 11947.521484 4
  339.091725 15579.616211 5
  340.055243 1649.655884 1
  340.094343 2362.286621 1
  341.068089 4856.225098 2
  345.045153 4268.320313 1
  345.047575 4763.046387 2
  347.023790 3083.018311 1
  359.046288 1641.158325 1
  365.113206 2656.446289 1
  367.989007 2013.131714 1
  370.989356 2152.160400 1
  371.982268 4898.500488 2
  376.985005 1707.053101 1
  391.050453 1842.508423 1
  451.038185 2181.237793 1
  451.159463 1923.792114 1
  451.175758 3644.575195 1
  451.190243 13680.254883 4
  451.204729 748526.687500 246
  451.221026 15822.619141 5
  451.230081 3134.897461 1
  451.235514 3994.823975 1
  452.191402 1899.388306 1
  452.207753 131722.781250 43
  452.224105 2850.322754 1
  453.203188 2310.621582 1
  453.212302 9702.923828 3
  454.211058 1565.892944 1
  460.126163 18732.402344 6
  461.129165 2793.244141 1
  473.170593 3832.785400 1
  473.186150 202981.171875 67
  473.203653 3939.664307 1
  474.191209 33081.484375 11
  475.162291 70568.882813 23
  475.193603 3310.200684 1
  476.099066 3134.589355 1
  476.165804 11889.148438 4
  477.168561 1544.788696 1
  489.152236 4890.459473 2
  489.160412 7518.668457 2
  493.172750 3196.036621 1
  495.169351 11732.467773 4
  496.172202 2434.456055 1
  500.121236 4465.913574 1
  503.128955 4273.503906 1
  504.117600 37557.425781 12
  505.124176 89253.343750 29
  506.127315 16624.894531 5
  507.124816 5580.688965 2
  509.120002 2584.285400 1
  509.306704 2729.252197 1
  511.137902 6893.920410 2
  512.134930 6847.254395 2
  513.112919 1597.586304 1
  513.121703 1920.758667 1
  513.132683 85382.382813 28
  514.135557 15454.619141 5
  515.128120 5520.063477 2
  519.312781 2840.234863 1
  521.169034 26965.070313 9
  522.170773 3362.569824 1
  527.106427 3944.977783 1
  535.158699 7866.903320 3
  535.306085 12158.369141 4
  535.322465 3155.651611 1
  536.161185 2090.544678 1
  536.311331 2400.625000 1
  537.302940 7424.458984 2
  538.304381 1915.298950 1
  541.101954 1859.475708 1
  547.214894 1556.151978 1
  549.174251 1727.872681 1
  550.121309 2149.297607 1
  551.129482 2971.508057 1
  555.264169 2337.430420 1
  561.320247 1750.954712 1
  563.300345 26073.656250 9
  564.306988 4683.410156 2
  565.158920 9396.425781 3
  565.194459 2280.493652 1
  571.151039 6336.986816 2
  572.155537 1586.750244 1
  651.390866 3265.682861 1
  671.399110 2375.694092 1
  677.311367 21433.658203 7
  678.314901 4574.515625 2
  689.358914 2335.877441 1
  691.404929 2962.099365 1
  697.396068 2109.198730 1
  699.292790 15077.483398 5
  700.296570 3298.998291 1
  701.270935 76061.679688 25
  702.271947 17688.167969 6
  703.278627 2817.619629 1
  713.289206 3478.554199 1
  715.258408 14331.640625 5
  715.406607 2065.426270 1
  716.260554 3541.964355 1
  717.402740 2679.731934 1
  721.277400 4836.176758 2
  723.254072 2093.940186 1
  729.236809 1739.306274 1
  730.223748 24792.919922 8
  731.231370 41416.105469 14
  732.233592 11653.531250 4
  737.241706 2284.578857 1
  739.238842 16560.128906 5
  740.242357 3486.660400 1
  767.385252 2569.670898 1
  775.277301 5734.777344 2
  776.281555 1673.828369 1
  791.267043 2039.085327 1
  797.259620 3000.144531 1
  877.498903 4006.521240 1
  893.629613 3148.653809 1
  897.503150 2938.880127 1
  903.419844 27047.808594 9
  904.421067 11847.863281 4
  905.423955 3086.728516 1
  905.980119 3090.127197 1
  917.652885 3121.396973 1
  918.651565 1695.170410 1
  919.630801 5134.111816 2
  920.632712 3489.524902 1
  925.400929 15302.895508 5
  926.406960 5565.786133 2
  927.377283 6646.080566 2
  928.381195 2164.475342 1
  939.396655 4242.407227 1
  949.364650 2517.370605 1
  957.339551 10796.739258 4
  958.342073 3827.200928 1
  965.347359 2998.230225 1
  979.318151 2786.857910 1
  987.328355 2004.355103 1
  1001.385545 1922.119019 1
  1005.975263 12470.120117 4
  1006.976678 1746.055054 1
  1073.735930 4352.888184 1
  1074.733724 2881.539307 1
  1099.730996 3039.683594 1
  1100.730753 3730.666748 1
  1101.738784 1760.506226 1
  1103.606601 1572.019531 1
  1105.965432 14821.484375 5
  1106.973704 1749.682739 1
  1129.523559 30672.730469 10
  1130.528317 16582.583984 5
  1131.534416 5285.045410 2
  1132.534658 1527.827881 1
  1151.506096 3599.218750 1
  1152.518157 2144.093018 1
  1153.487144 2022.256470 1
  1165.985321 15194.692383 5
  1166.993939 3600.694824 1
  1167.476129 2656.286865 1
  1183.442203 5166.636230 2
  1191.451211 1740.700073 1
  1205.964553 5858.754883 2
  1233.969956 3105.121338 1
  1243.077660 3039.780518 1
  1265.978062 24774.242188 8
  1266.982865 5980.042480 2
  1280.830138 1652.694580 1
  1305.953902 1563.602539 1
  1333.966349 5564.633301 2
  1334.979463 1884.615112 1
  1355.627994 9512.518555 3
  1356.127923 1867.308228 1
  1356.637568 5930.077637 2
  1357.648270 1725.770386 1
  1365.974981 15552.646484 5
  1366.967491 3949.512451 1
  1382.957032 1549.211670 1
  1409.549866 2093.440186 1
  1433.958002 5098.865723 2
  1465.969084 8348.812500 3
  1466.966411 1708.743286 1
  1469.677056 1928.311890 1