ACCESSION: MSBNK-NAIST-KNA00515
RECORD_TITLE: Uridine; LC-ESI-ITFT; MS; NEG
DATE: 2016.01.19 (Created 2009.11.18, modified 2011.08.03)
AUTHORS: Takahashi H, Kanaya S, Ogasawara N, Graduate School of Information Science, NAIST
LICENSE: CC BY-SA
COMMENT: [Spectral] Uridine (exact mass = 244.06954) and Glutathione (exact mass = 307.08381) were not completely separated on HPLC under the present analytical conditions as described in "AC$XXX". Additionally some of the peaks in this data contains dimers and other unidentified ions.

CH$NAME: Uridine
CH$COMPOUND_CLASS: Natural Product
CH$FORMULA: C9H12N2O6
CH$EXACT_MASS: 244.06954
CH$SMILES: OC[C@@H](O1)[C@@H](O)[C@@H](O)[C@@H]1N(C=2)C(=O)NC(=O)C2
CH$IUPAC: InChI=1S/C9H12N2O6/c12-3-4-6(14)7(15)8(17-4)11-2-1-5(13)10-9(11)16/h1-2,4,6-8,12,14-15H,3H2,(H,10,13,16)/t4-,6-,7-,8-/m1/s1
CH$LINK: CAS 58-96-8
CH$LINK: CHEBI 16704
CH$LINK: KEGG C00299
CH$LINK: KNAPSACK C00019674
CH$LINK: NIKKAJI J4.593D
CH$LINK: PUBCHEM 3593
CH$LINK: INCHIKEY DRTQHJPVMGBUCF-XVFCMESISA-N
CH$LINK: COMPTOX DTXSID40891555

AC$INSTRUMENT: LTQ Orbitrap XL, Thermo Scientfic
AC$INSTRUMENT_TYPE: LC-ESI-ITFT
AC$MASS_SPECTROMETRY: MS_TYPE MS
AC$MASS_SPECTROMETRY: ION_MODE NEGATIVE
AC$MASS_SPECTROMETRY: COLLISION_ENERGY 35eV
AC$MASS_SPECTROMETRY: IONIZATION ESI
AC$CHROMATOGRAPHY: COLUMN_NAME TOSOH TSKgel ODS-100V 5um Part no. 21456
AC$CHROMATOGRAPHY: FLOW_GRADIENT 0min:3%, 45min:97%, 50min:97%, 50.1:3%, 57min:3% (acetonitrile)
AC$CHROMATOGRAPHY: FLOW_RATE 0.5 ml/min
AC$CHROMATOGRAPHY: RETENTION_TIME 5.491278 min
AC$CHROMATOGRAPHY: SOLVENT A 0.1%formate-water
AC$CHROMATOGRAPHY: SOLVENT B 0.1%formate-acetonitrile

MS$FOCUSED_ION: BASE_PEAK 243.061356

PK$SPLASH: splash10-052f-0697120000-2d1765c86aaf91382c70
PK$NUM_PEAK: 802
PK$PEAK: m/z int. rel.int.
  100.143768 769.457642 1
  101.072058 2391.510986 2
  101.078010 729.542847 1
  102.864816 759.983887 1
  102.998190 926.798218 1
  103.830488 717.387695 1
  103.920296 986.551514 1
  104.563340 765.699707 1
  105.730328 709.697754 1
  106.879167 735.232178 1
  107.034651 1212.667480 1
  107.036325 33724.500000 29
  108.045347 3949.601807 3
  108.192965 831.069946 1
  109.077098 862.359985 1
  109.169490 863.062500 1
  109.814969 649.428467 1
  109.992814 916.101196 1
  110.004802 1070.663818 1
  110.018972 1369.450684 1
  110.021153 2067.875000 2
  110.023115 4883.916504 4
  110.024859 234663.453125 204
  110.026603 6834.408203 6
  110.028566 2752.631348 2
  110.030528 958.213501 1
  110.044922 1489.421753 1
  110.190539 799.518433 1
  110.999829 1488.225952 1
  111.010877 905.072632 1
  111.014191 1611.592407 1
  111.016180 2115.848877 2
  111.018169 7634.966797 7
  111.019937 257796.375000 224
  111.021926 7304.590820 6
  111.023916 3274.126709 3
  111.025684 1080.397949 1
  111.026568 766.170776 1
  111.027894 6618.387695 6
  111.040494 1599.286499 1
  111.464383 706.783813 1
  112.023200 6314.508789 5
  112.040226 3380.443604 3
  112.128558 722.561279 1
  112.227101 727.835205 1
  112.983832 1263.664795 1
  112.985648 55173.906250 48
  112.987236 1173.117920 1
  113.035810 1517.826172 1
  113.994807 703.763672 1
  114.506084 857.089355 1
  114.838774 749.988037 1
  115.842996 759.694092 1
  115.904502 713.381592 1
  116.617144 777.305420 1
  117.019088 922.738892 1
  118.992611 964.234375 1
  120.012429 794.972412 1
  120.045224 1259.099854 1
  120.863204 839.020630 1
  122.024533 7852.698242 7
  122.025552 2283.674316 2
  123.056061 1263.145508 1
  124.040150 2437.555176 2
  124.133119 743.980591 1
  124.641065 683.555176 1
  124.645008 821.596069 1
  125.716672 709.790161 1
  125.784076 876.858643 1
  126.055572 1035.088623 1
  127.051039 4013.210205 3
  127.507896 801.378540 1
  128.031791 1104.762817 1
  128.032612 955.689453 1
  128.035075 34140.066406 30
  128.036991 1985.978882 2
  128.853824 734.168579 1
  130.309940 703.731201 1
  131.045996 2144.407959 2
  131.712020 710.760376 1
  132.431207 710.218018 1
  133.447074 787.477661 1
  134.020053 2176.960205 2
  134.039401 1741.189331 2
  134.041160 3403.987793 3
  134.042333 6663.521973 6
  134.044679 10013.814453 9
  134.047025 363078.531250 316
  134.049664 10417.552734 9
  134.052303 4291.696777 4
  134.054648 1744.953247 2
  134.055821 852.625610 1
  134.074298 2314.289795 2
  134.128576 976.268555 1
  134.156167 760.756958 1
  134.767119 847.473633 1
  135.043914 3898.242432 3
  135.050140 14037.296875 12
  135.056071 1622.569214 1
  135.299259 908.669189 1
  136.972860 892.359985 1
  137.876829 799.031982 1
  137.924557 919.036377 1
  138.055325 909.099854 1
  138.191496 760.910522 1
  138.693753 742.482544 1
  139.006887 11426.758789 10
  139.038166 885.531982 1
  139.368010 757.888672 1
  140.031854 958.346802 1
  140.034985 28705.302734 25
  140.980239 1355.194336 1
  141.038448 924.926636 1
  141.066616 7445.167480 6
  141.831005 794.288330 1
  143.040181 1084.561523 1
  143.041474 845.518188 1
  143.043090 2062.341553 2
  143.045999 77025.054688 67
  143.047939 2184.233398 2
  143.889796 1019.813110 1
  144.049390 2697.436523 2
  145.061395 6193.448242 5
  145.890149 1649.207642 1
  146.045748 5723.871094 5
  146.938136 2120.884521 2
  147.892403 1247.358643 1
  148.952117 7806.151855 7
  149.049707 900.088745 1
  149.071712 860.679810 1
  151.980091 782.118164 1
  152.032849 834.222656 1
  152.034974 36655.964844 32
  152.037453 1228.140991 1
  153.026527 915.939819 1
  153.030103 29678.179688 26
  153.038330 1060.637207 1
  153.066591 5680.337402 5
  153.142112 765.157349 1
  155.082368 8728.751953 8
  155.911024 815.843750 1
  156.085510 1037.711304 1
  156.894379 2521.018066 2
  156.900320 1029.515869 1
  157.340877 791.915283 1
  159.771111 934.402954 1
  159.893276 2597.741455 2
  160.004874 1010.956665 1
  160.007168 13695.309570 12
  160.191259 846.769287 1
  160.892241 3689.293701 3
  161.451229 906.841431 1
  161.893981 1185.102295 1
  162.892928 4440.297363 4
  164.034831 1480.613770 1
  164.895156 1408.988892 1
  164.947175 743.706787 1
  165.514169 1184.473999 1
  166.098247 3108.706055 3
  166.310779 825.885620 1
  167.046237 2224.761475 2
  167.976863 866.760376 1
  168.621186 728.004761 1
  168.722171 858.951172 1
  170.032794 948.677368 1
  170.144693 737.285645 1
  171.077267 1048.821899 1
  172.953963 1227.493286 1
  173.413831 999.541748 1
  174.955673 2975.503906 3
  177.033715 9507.575195 8
  178.059935 887.470337 1
  178.086872 2699.952881 2
  178.272006 948.630249 1
  178.411046 673.021484 1
  179.034442 1417.215332 1
  179.045304 2473.445068 2
  181.061452 2678.574951 2
  182.045422 1610.520752 1
  182.949510 1542.478394 1
  183.040710 1355.783813 1
  183.668327 1198.537598 1
  184.108354 4604.367188 4
  184.110714 757.503784 1
  184.276489 717.668335 1
  184.486509 1432.703491 1
  185.056406 3884.649658 3
  185.706858 833.268921 1
  185.758028 851.996216 1
  186.969299 2978.831543 3
  189.761564 985.135742 1
  190.266813 848.296509 1
  190.424094 858.459717 1
  190.843799 832.386963 1
  190.928006 1137.289795 1
  191.151500 875.367310 1
  193.061567 1080.177124 1
  194.734189 810.477539 1
  197.056374 3653.321045 3
  197.909965 802.641968 1
  198.087880 7983.118164 7
  198.090514 804.296875 1
  198.194322 1079.779785 1
  199.071776 2954.929443 3
  199.370342 892.023193 1
  200.042171 1529.744507 1
  200.050724 1260.093628 1
  200.056070 83251.117188 72
  200.060347 1984.815796 2
  201.058994 5593.712891 5
  202.060253 936.391968 1
  206.081763 2602.726563 2
  208.964460 1065.413818 1
  210.087546 11772.249023 10
  210.972281 2410.619385 2
  211.091016 1497.376831 1
  212.681814 906.208252 1
  214.227263 793.699341 1
  219.966671 1600.093628 1
  224.959425 1498.968628 1
  225.099096 2205.784180 2
  228.098275 7797.963867 7
  228.404485 787.068970 1
  230.952759 5952.644531 5
  230.959390 5825.108887 5
  231.005817 740.101318 1
  231.008470 786.955811 1
  233.963899 1296.357178 1
  238.080249 2422.431885 2
  238.108013 1740.677368 2
  238.966930 2586.070313 2
  239.122643 1148.851807 1
  242.069786 914.304810 1
  242.077614 4385.691406 4
  242.863703 2094.536621 2
  242.934510 923.522949 1
  242.995328 5240.542969 5
  243.030399 1297.574951 1
  243.035409 1594.499634 1
  243.036841 1737.937134 2
  243.039704 2179.964355 2
  243.042568 4044.628662 4
  243.049727 9033.109375 8
  243.055454 22323.066406 19
  243.057601 6534.957031 6
  243.061181 1147565.500000 999
  243.067625 22488.810547 20
  243.074069 9403.550781 8
  243.076933 1329.028320 1
  243.079797 4161.475586 4
  243.082661 2736.614746 2
  243.089821 1481.364136 1
  243.091969 1337.447144 1
  243.094834 747.027954 1
  243.098414 1197.828247 1
  243.104143 1937.417114 2
  243.109872 1360.488159 1
  243.112021 1122.839111 1
  243.127777 4502.228027 4
  243.142819 833.454468 1
  243.252449 1230.541016 1
  243.259617 1706.611450 1
  244.057959 5008.033691 4
  244.060840 1171.060181 1
  244.064442 88318.281250 77
  244.070925 971.219971 1
  244.909469 861.768677 1
  245.055807 1412.534546 1
  245.065229 7287.646973 6
  246.068538 918.692749 1
  247.003195 3575.120605 3
  248.070105 1041.259399 1
  250.076020 858.446655 1
  254.077345 17417.453125 15
  255.967049 874.595459 1
  256.986740 1208.066040 1
  257.982003 3138.128906 3
  259.962233 1016.900513 1
  260.088190 5080.832520 4
  262.001401 1074.398682 1
  266.088407 21141.068359 18
  266.102349 1794.014526 2
  267.047170 1224.034668 1
  267.091698 1493.156494 1
  267.335149 855.957520 1
  270.926085 2070.947510 2
  271.062624 3625.261963 3
  271.845073 833.412109 1
  272.074703 1339.407349 1
  272.080638 1481.127319 1
  272.088270 78636.570313 68
  272.095053 1613.234253 1
  272.923716 1635.244873 1
  273.091608 7648.932129 7
  273.606476 945.698730 1
  273.837485 908.596191 1
  273.924832 3216.717773 3
  274.923714 2587.975586 2
  275.924606 1844.750366 2
  275.956649 1547.619141 1
  276.924009 3899.104248 3
  277.143543 943.834106 1
  277.750358 1264.911865 1
  278.152211 824.269897 1
  278.926851 1927.134399 2
  279.024569 1075.549072 1
  279.030733 3652.541504 3
  279.038659 210070.156250 183
  279.043062 1594.493408 1
  279.045704 3548.524414 3
  279.053630 1634.999390 1
  280.041762 18982.933594 17
  280.982642 3243.119141 3
  281.027140 930.771484 1
  281.035151 57260.953125 50
  281.042272 1912.337769 2
  281.205239 863.263184 1
  282.038310 4262.838867 4
  285.978094 917.965210 1
  286.704950 937.142700 1
  287.034501 11883.243164 10
  288.037654 1386.158569 1
  288.065364 12707.307617 11
  288.069059 790.027344 1
  289.051646 1687.408936 1
  289.059074 4228.770508 4
  289.067431 243004.671875 212
  289.074859 4441.250488 4
  289.083217 2161.266846 2
  289.094360 792.167114 1
  290.070069 19079.027344 17
  290.736712 792.662109 1
  291.071365 2094.924561 2
  294.934489 774.514282 1
  296.980511 1666.800903 1
  298.996120 6695.609863 6
  302.065170 10835.980469 9
  303.069451 925.921265 1
  303.338771 811.417603 1
  304.059716 2891.472412 3
  304.063723 1775.396118 2
  305.796061 1638.510254 1
  305.983052 4271.318359 4
  306.014403 1549.855347 1
  306.042723 1738.710571 2
  306.045758 1653.255615 1
  306.048792 4431.612305 4
  306.057897 48751.078125 42
  306.068013 17849.041016 16
  306.076106 1049098.125000 913
  306.084200 17433.060547 15
  306.090270 2380.102783 2
  306.093306 7296.999023 6
  306.099376 1382.345581 1
  306.102412 3332.484375 3
  306.105447 2121.185791 2
  306.111518 2014.561890 2
  306.128721 1128.849121 1
  306.136816 1545.416992 1
  306.143900 1034.671387 1
  306.169203 4147.035645 4
  306.356536 1682.974609 1
  306.992724 1095.146240 1
  307.059807 3257.972412 3
  307.072006 6279.351074 5
  307.079123 88765.890625 77
  307.087256 1243.564941 1
  308.060515 940.196899 1
  308.071753 33406.832031 29
  308.078904 7605.731445 7
  309.074337 1989.676392 2
  309.082550 1357.269653 1
  311.048635 8881.883789 8
  312.084547 1327.403320 1
  312.093922 65765.125000 57
  312.099130 2482.247559 2
  313.097380 7683.836914 7
  314.098323 1321.072021 1
  314.997366 4578.063965 4
  315.987278 16964.283203 15
  317.061845 33245.996094 29
  318.064727 2647.132813 2
  319.077759 29509.267578 26
  320.080490 3142.435547 3
  322.023747 1593.980469 1
  324.987478 907.262573 1
  325.002975 809.619995 1
  326.007097 1306.520386 1
  326.056035 885.799072 1
  327.022583 1227.817383 1
  328.057415 46220.074219 40
  329.061075 2652.141602 2
  329.084759 1940.270874 2
  330.034229 6300.827148 5
  330.053487 1699.919922 1
  331.993535 2632.452637 2
  332.073550 1343.246338 1
  333.093414 5035.969727 4
  335.060366 1138.193726 1
  335.071954 24169.765625 21
  335.311955 1075.236694 1
  335.966017 933.646118 1
  336.075407 1601.729126 1
  338.732197 878.358032 1
  340.089603 2310.593994 2
  340.991939 1128.806396 1
  341.028821 35889.246094 31
  341.038340 14331.438477 12
  342.031682 2108.263916 2
  342.041243 1320.609619 1
  342.104594 2658.755859 2
  342.986163 19397.185547 17
  343.024569 1484.484985 1
  343.036573 1402.333618 1
  343.989239 1496.075195 1
  344.031431 3027.642090 3
  344.606009 821.897583 1
  344.978562 1453.194824 1
  345.034255 980.937134 1
  346.054849 9305.315430 8
  347.522638 825.234253 1
  349.088491 3356.940186 3
  349.323973 942.434204 1
  349.992262 3005.784912 3
  350.039274 853.400391 1
  350.993948 1169.461182 1
  351.806625 978.656494 1
  352.998987 2634.611816 2
  354.383890 779.629028 1
  354.879752 880.638916 1
  354.992191 2184.617676 2
  355.959599 1183.040283 1
  355.997667 1065.702515 1
  357.054580 5748.305664 5
  357.999721 1637.060303 1
  358.099563 1059.772217 1
  358.880533 856.517822 1
  358.987168 36584.097656 32
  358.997449 911.884644 1
  359.030864 1661.927612 1
  359.994192 32004.470703 28
  360.998978 3014.059570 3
  361.989760 1882.678589 2
  362.763916 792.061035 1
  363.010759 1616.498657 1
  363.270936 796.648071 1
  364.054457 1075.257568 1
  364.221183 923.467773 1
  364.973529 1071.075684 1
  366.013802 7414.705566 6
  367.016016 1344.067627 1
  368.075712 1409.769653 1
  368.131753 963.206421 1
  370.009827 4038.202881 4
  371.984979 2072.486328 2
  372.996865 1667.135010 1
  374.021084 1210.560303 1
  374.051151 928.352173 1
  375.593532 807.886597 1
  378.356415 828.264526 1
  379.035866 865.976440 1
  382.056894 1558.377075 1
  382.952973 2118.559082 2
  383.076182 13810.062500 12
  383.088932 1342.633545 1
  383.657626 833.094482 1
  384.950032 1819.904907 2
  385.952276 2775.638672 2
  386.005285 1331.114014 1
  386.951249 3288.538330 3
  387.623712 775.550171 1
  387.952661 2176.654785 2
  387.971430 1049.252686 1
  387.984424 4772.924316 4
  387.991643 724.011719 1
  388.950720 4358.032227 4
  388.991302 1084.301392 1
  390.028298 3102.379883 3
  390.951124 1171.481201 1
  390.956966 1376.319458 1
  393.037655 1408.154053 1
  393.940164 1059.094116 1
  399.060874 6399.666992 6
  401.173279 793.775879 1
  403.769620 783.241943 1
  404.042608 1653.435425 1
  405.979842 2244.038574 2
  406.115877 3157.755859 3
  408.979105 1214.005127 1
  409.977884 1371.063110 1
  410.972455 1154.982056 1
  410.980326 851.349487 1
  411.010235 3750.443848 3
  411.978549 3595.968018 3
  414.105319 979.331909 1
  416.330439 879.237549 1
  420.165258 992.814209 1
  422.088639 4624.847656 4
  423.093100 869.142700 1
  426.020086 1460.277222 1
  427.980510 973.456543 1
  428.015640 17384.554688 15
  429.017841 1766.164917 2
  433.164220 827.263306 1
  433.957322 912.043701 1
  436.172421 971.925293 1
  437.034211 774.033447 1
  439.034737 1521.684448 1
  444.699233 896.826782 1
  448.023834 950.730957 1
  451.041804 5080.593750 4
  452.044284 1317.284790 1
  464.031371 963.197876 1
  465.018757 2834.701660 2
  466.182302 961.361206 1
  474.996000 1375.713745 1
  482.102153 27745.230469 24
  482.178159 8420.146484 7
  483.105673 2939.219727 3
  484.098242 1970.539429 2
  486.574839 877.896240 1
  487.092342 1146.692505 1
  487.098435 1286.589722 1
  487.114684 4422.728516 4
  487.130934 291547.156250 254
  487.147185 3450.544678 3
  487.165468 2041.407593 2
  488.052411 1234.969238 1
  488.133903 54382.859375 47
  489.135885 6281.489746 5
  494.119731 2838.916016 2
  495.117311 10111.964844 9
  496.120003 1396.256836 1
  499.186457 1796.641724 2
  500.554697 947.005737 1
  501.601550 807.231567 1
  504.083387 1916.754272 2
  509.111320 1638.441895 1
  510.156843 20359.988281 18
  510.169905 2394.162109 2
  511.089873 30020.683594 26
  511.161918 2359.657471 2
  511.175019 1166.603149 1
  512.093329 4366.991699 4
  512.189676 1533.760132 1
  517.148550 3576.557617 3
  518.143171 20351.197266 18
  518.154312 967.537842 1
  519.147367 5016.370117 4
  523.107583 9727.228516 8
  523.207055 765.691895 1
  524.110385 1442.446167 1
  525.104705 2775.151367 2
  526.010677 892.521606 1
  530.015255 871.698242 1
  531.095799 1449.767822 1
  532.098480 903.049072 1
  533.136561 1318.359497 1
  534.117042 27109.554688 24
  535.118939 4682.238281 4
  535.144666 1000.552490 1
  536.020480 1598.838989 1
  536.046272 1753.941772 2
  538.047274 6845.822754 6
  540.042904 125656.851563 109
  540.175708 2025.439087 2
  541.044885 18103.328125 16
  541.170924 7630.436035 7
  542.047273 4640.302246 4
  544.218698 1498.206421 1
  545.215492 1141.925903 1
  546.133034 1443.614868 1
  547.214894 1209.442505 1
  549.218019 929.036377 1
  550.145688 30071.044922 26
  551.149039 5035.125000 4
  552.147783 983.859741 1
  554.121395 2279.427246 2
  555.125762 1169.623169 1
  555.363062 1150.340454 1
  557.142706 6300.123535 5
  561.074097 4213.365723 4
  563.070561 100310.703125 87
  563.090756 1098.314697 1
  563.300345 1009.029419 1
  564.074057 16002.869141 14
  569.658234 829.661133 1
  572.127096 10465.376953 9
  573.131579 2249.844971 2
  573.154911 1137.604736 1
  573.173058 955.370483 1
  574.089330 1353.727173 1
  574.102324 8730.674805 8
  574.286889 902.969849 1
  575.106805 1259.176636 1
  576.048616 1308.961670 1
  577.052974 10609.197266 9
  578.057334 3241.425049 3
  578.887973 752.617920 1
  578.953764 786.811279 1
  579.051156 1007.295898 1
  579.773149 883.993286 1
  582.101112 1002.615601 1
  584.157603 956.125488 1
  586.096315 17778.412109 15
  587.100199 3739.366699 3
  590.124666 1220.019531 1
  594.060625 2342.572510 2
  595.065852 1244.729980 1
  596.612895 818.214233 1
  597.130836 2531.770020 2
  598.085833 1602.008423 1
  599.084675 1050.626221 1
  600.080467 13015.669922 11
  601.084312 2248.419434 2
  603.057603 14748.222656 13
  604.060516 1830.866089 2
  605.046250 1406.176758 1
  605.057498 845.924805 1
  605.085617 866.567261 1
  607.064531 5442.630859 5
  608.029303 2159.352295 2
  609.010575 1952.559204 2
  612.011588 1348.906250 1
  613.160258 8460.246094 7
  614.013105 1947.508423 2
  614.162608 2167.297852 2
  615.011785 2047.761353 2
  615.155888 1726.837646 2
  617.088865 1230.494141 1
  623.107310 3163.683350 3
  627.093487 2630.928467 2
  628.097494 1402.384521 1
  630.091839 4574.123047 4
  631.094074 2327.671875 2
  632.038656 1300.300171 1
  633.039522 1229.277832 1
  635.039329 1798.501587 2
  635.139114 1003.420044 1
  636.035212 1828.700806 2
  636.344441 907.614502 1
  637.036476 1732.442505 2
  637.118503 3205.680420 3
  638.037062 2938.982422 3
  640.039201 2576.686035 2
  644.105826 1738.050659 2
  652.044679 1479.418213 1
  652.072992 1035.136475 1
  659.059051 843.126221 1
  666.070287 3014.779053 3
  667.081484 1583.342407 1
  668.796987 972.243530 1
  670.073214 1230.093262 1
  671.037709 2163.491455 2
  680.100754 990.661499 1
  680.241514 3337.450439 3
  686.114996 1735.024048 2
  688.300075 851.801147 1
  689.058092 1434.417725 1
  695.871061 999.220581 1
  701.102554 1041.328735 1
  702.834858 906.973877 1
  705.022543 850.187500 1
  710.246898 1128.406250 1
  719.899642 803.330444 1
  723.081386 1451.427490 1
  724.155247 900.915039 1
  731.201484 12555.447266 11
  732.203645 2338.841797 2
  739.189479 1525.930786 1
  753.183189 2743.382080 2
  754.226981 11199.153320 10
  755.159233 1201.625244 1
  755.229810 4108.485352 4
  762.166793 823.297241 1
  762.214500 3659.442139 3
  763.213388 1121.280396 1
  773.120278 2110.371338 2
  774.120341 3341.326416 3
  775.081577 1040.791992 1
  775.118270 29663.763672 26
  776.118129 9506.430664 8
  777.111738 1580.021851 1
  777.124017 1785.885376 2
  777.255008 1238.195923 1
  778.189277 2016.922729 2
  779.186868 998.516602 1
  784.112442 1170.462524 1
  785.241994 1733.848755 2
  786.870006 853.887085 1
  789.185385 1100.094116 1
  794.214680 1662.476563 1
  796.150732 4396.952148 4
  797.149052 5916.272461 5
  798.102391 1275.446899 1
  798.144991 44977.867188 39
  799.147066 12740.222656 11
  800.138200 3276.711182 3
  806.093646 1454.893677 1
  807.136726 3470.438477 3
  808.142766 1589.520996 1
  811.718080 886.977295 1
  818.121746 860.074097 1
  819.143971 903.342896 1
  819.174977 2116.268066 2
  820.132613 1076.403809 1
  820.176988 1876.965942 2
  821.171947 21576.804688 19
  822.173172 5923.191406 5
  830.167957 2563.435059 2
  831.172102 1275.829712 1
  831.702047 861.379272 1
  838.128623 4164.015137 4
  842.126569 872.364014 1
  844.198836 4157.562012 4
  845.200698 1690.679932 1
  847.125926 2564.002930 2
  855.256740 914.873779 1
  861.160902 3805.623779 3
  862.154856 1023.301025 1
  862.250520 988.491089 1
  874.173807 1181.114990 1
  877.700289 907.631348 1
  878.378635 804.526611 1
  884.718129 1043.933350 1
  893.962811 897.035522 1
  905.980119 2716.333740 2
  906.634782 854.276367 1
  928.375851 856.781128 1
  929.210115 933.892212 1
  995.330442 820.251831 1
  998.261718 1000.012573 1
  998.297472 1320.848755 1
  1005.884847 831.621948 1
  1005.969235 12729.139648 11
  1006.976678 2950.757568 3
  1018.116190 829.902344 1
  1020.280060 1421.246948 1
  1021.321416 1184.651733 1
  1023.248111 817.601685 1
  1024.826866 811.187012 1
  1033.227348 852.225098 1
  1041.814128 945.546997 1
  1042.214489 1431.759644 1
  1043.219585 1199.477905 1
  1045.866488 891.507324 1
  1065.238240 1439.632813 1
  1080.038620 1004.346924 1
  1095.129069 1063.204834 1
  1104.604713 756.724121 1
  1105.965432 9856.213867 9
  1106.973704 3510.458496 3
  1107.976389 1398.673096 1
  1110.307311 895.305420 1
  1125.624908 937.062134 1
  1147.427090 804.163330 1
  1160.267059 939.701538 1
  1165.985321 13673.746094 12
  1166.993939 4755.053223 4
  1175.856408 973.689453 1
  1182.973150 2092.558838 2
  1186.162047 857.521729 1
  1192.283026 1122.830078 1
  1205.956640 7246.520996 6
  1206.962121 1478.954346 1
  1232.497164 869.122192 1
  1233.969956 3482.915283 3
  1237.112527 854.199951 1
  1250.062445 947.157104 1
  1255.953397 1496.612549 1
  1265.382558 1404.097412 1
  1265.978062 27672.955078 24
  1266.395166 1357.654175 1
  1266.982865 6667.623047 6
  1267.988864 981.047852 1
  1271.022621 852.427856 1
  1274.342265 1044.049561 1
  1279.376428 1038.654419 1
  1282.963258 3848.771240 3
  1289.578405 823.173950 1
  1333.966349 8740.794922 8
  1334.970248 1367.287720 1
  1349.537951 799.280518 1
  1355.939238 1316.855469 1
  1362.053718 880.487549 1
  1362.462186 945.649170 1
  1365.974981 15264.875000 13
  1366.967491 5134.925293 4
  1370.756583 912.656860 1
  1382.957032 2048.683105 2
  1383.968112 1351.754272 1
  1390.430092 848.649536 1
  1407.881650 952.408325 1
  1430.231002 929.824585 1
  1433.958002 7488.127930 7
  1434.963914 1293.680542 1
  1438.585729 995.888550 1
  1465.958479 7256.583984 6
  1466.977026 2914.267822 3
  1472.790248 827.702637 1
  1482.965940 1331.307617 1
  1483.786276 963.762085 1