ACCESSION: MSBNK-NAIST-KNA00519
RECORD_TITLE: L-Glutathione (reduced form); LC-ESI-ITFT; MS; NEG
DATE: 2016.01.19 (Created 2009.11.18, modified 2011.08.03)
AUTHORS: Takahashi H, Kanaya S, Ogasawara N, Graduate School of Information Science, NAIST
LICENSE: CC BY-SA

CH$NAME: Glutathione
CH$NAME: 5-L-Glutamyl-L-cysteinylglycine
CH$NAME: N-(N-gamma-L-Glutamyl-L-cysteinyl)glycine
CH$NAME: gamma-L-Glutamyl-L-cysteinyl-glycine
CH$NAME: GSH
CH$NAME: Reduced glutathione
CH$NAME: L-Glutathione (reduced form)
CH$COMPOUND_CLASS: Natural Product
CH$FORMULA: C10H17N3O6S
CH$EXACT_MASS: 307.08381
CH$SMILES: OC(=O)CNC(=O)C(CS)NC(=O)CCC(N)C(O)=O
CH$IUPAC: InChI=1S/C10H17N3O6S/c11-5(10(18)19)1-2-7(14)13-6(4-20)9(17)12-3-8(15)16/h5-6,20H,1-4,11H2,(H,12,17)(H,13,14)(H,15,16)(H,18,19)/t5-,6-/m0/s1
CH$LINK: CAS 70-18-8
CH$LINK: CHEBI 16856
CH$LINK: KEGG C00051
CH$LINK: KNAPSACK C00001518
CH$LINK: NIKKAJI J10.686K
CH$LINK: PUBCHEM 3353
CH$LINK: INCHIKEY RWSXRVCMGQZWBV-WDSKDSINSA-N
CH$LINK: COMPTOX DTXSID6023101

AC$INSTRUMENT: LTQ Orbitrap XL, Thermo Scientfic
AC$INSTRUMENT_TYPE: LC-ESI-ITFT
AC$MASS_SPECTROMETRY: MS_TYPE MS
AC$MASS_SPECTROMETRY: ION_MODE NEGATIVE
AC$MASS_SPECTROMETRY: COLLISION_ENERGY 35eV
AC$MASS_SPECTROMETRY: IONIZATION ESI
AC$CHROMATOGRAPHY: COLUMN_NAME TOSOH TSKgel ODS-100V 5um Part no. 21456
AC$CHROMATOGRAPHY: FLOW_GRADIENT 0min:3%, 45min:97%, 50min:97%, 50.1:3%, 57min:3% (acetonitrile)
AC$CHROMATOGRAPHY: FLOW_RATE 0.5 ml/min
AC$CHROMATOGRAPHY: RETENTION_TIME 8.883203 min
AC$CHROMATOGRAPHY: SOLVENT A 0.1%formate-water
AC$CHROMATOGRAPHY: SOLVENT B 0.1%formate-acetonitrile

MS$FOCUSED_ION: BASE_PEAK 306.075958

PK$SPLASH: splash10-0a4i-0119003000-40d77c58256953bd8131
PK$NUM_PEAK: 204
PK$PEAK: m/z int. rel.int.
  101.072125 20391.390625 2
  102.056029 5827.943359 1
  111.056496 4907.701172 1
  112.040536 13946.587891 2
  116.017366 5105.893066 1
  123.056169 16752.835938 2
  125.035411 9849.964844 1
  126.043388 4875.518066 1
  127.051156 42468.757813 5
  128.033278 9867.616211 1
  128.035468 313214.062500 36
  128.037384 10048.913086 1
  128.039847 4511.515137 1
  129.038464 10947.500977 1
  131.046121 18663.587891 2
  133.043864 6248.887695 1
  135.056203 7363.393066 1
  137.071785 7123.140137 1
  138.055769 6126.762207 1
  141.066759 81758.375000 9
  143.040973 7781.216797 1
  143.043558 23559.398438 3
  143.046144 624372.375000 72
  143.048730 19152.115234 2
  143.051316 8251.357422 1
  144.011980 4663.475586 1
  144.049210 27053.068359 3
  145.061542 67377.257813 8
  146.045563 47589.910156 6
  148.952269 5269.642090 1
  151.006893 8322.373047 1
  153.066748 70994.960938 8
  155.082528 90562.968750 10
  160.007336 130072.906250 15
  162.002788 5455.692383 1
  166.098428 23321.589844 3
  167.046013 32445.208984 4
  167.082323 11184.978516 1
  171.077039 9907.139648 1
  177.033932 98571.125000 11
  179.045981 33705.363281 4
  180.077447 5987.747559 1
  181.061223 23146.148438 3
  184.108595 43199.960938 5
  185.056175 28930.820313 3
  187.041540 16476.046875 2
  197.056138 39117.468750 5
  198.087644 57885.039063 7
  199.072070 20999.769531 2
  210.087874 106383.875000 12
  211.091347 8771.250977 1
  216.098124 6767.369629 1
  228.098657 76343.234375 9
  229.101670 5855.285645 1
  230.952486 7801.956055 1
  231.044022 4895.138184 1
  242.078035 42420.828125 5
  254.077796 128207.015625 15
  255.080819 10939.315430 1
  260.088655 41553.566406 5
  271.058906 10120.753906 1
  272.075204 6344.076660 1
  272.081987 16996.066406 2
  272.088771 663417.687500 77
  272.093010 11479.556641 1
  272.096402 13937.737305 2
  272.102338 5977.644043 1
  273.091260 54315.417969 6
  274.092442 5515.957031 1
  288.065929 65265.500000 8
  289.068928 5739.768066 1
  305.796696 14860.968750 2
  305.982676 26924.806641 3
  305.987732 6337.285156 1
  305.991777 5314.689941 1
  305.997845 5935.127930 1
  306.001890 5683.173828 1
  306.004924 6274.435059 1
  306.012004 4634.084473 1
  306.020095 5942.219238 1
  306.022118 5014.199707 1
  306.030209 11684.374023 1
  306.034255 14133.244141 2
  306.038301 8746.344727 1
  306.040324 7522.309082 1
  306.044370 9953.934570 1
  306.046393 8595.156250 1
  306.050439 11285.865234 1
  306.052462 16757.097656 2
  306.059544 77284.679688 9
  306.067637 197837.515625 23
  306.075730 8634238.000000 999
  306.084835 184444.828125 21
  306.091917 86689.867188 10
  306.097988 20256.812500 2
  306.101024 8830.065430 1
  306.104059 12958.771484 1
  306.106083 9211.076172 1
  306.110130 7102.250488 1
  306.114177 11968.266602 1
  306.116201 7374.677734 1
  306.119237 12976.182617 2
  306.123285 7521.305664 1
  306.128344 7366.483887 1
  306.131380 5146.927734 1
  306.133404 4862.727539 1
  306.138464 4650.609863 1
  306.147572 7431.928223 1
  306.153644 7213.521973 1
  306.160729 6163.639648 1
  306.169838 26400.875000 3
  306.356159 13898.819336 2
  307.062479 8595.936523 1
  307.070612 26814.943359 3
  307.078745 949669.000000 110
  307.083829 14798.843750 2
  307.085862 18738.529297 2
  307.087895 19653.689453 2
  308.063202 6075.885742 1
  308.071374 330661.875000 38
  308.078526 50784.437500 6
  308.082612 16472.992188 2
  309.073957 26343.566406 3
  309.082170 5074.957031 1
  310.980895 4896.428711 1
  328.056999 145858.296875 17
  329.060658 9979.554688 1
  330.033810 5071.904785 1
  349.991827 22219.812500 3
  354.061008 4325.320801 1
  358.986729 34132.765625 4
  359.995042 54467.207031 6
  360.998537 6165.319336 1
  377.113182 7471.807617 1
  404.043650 125741.523438 15
  404.051322 6323.540039 1
  405.045955 10038.392578 1
  406.039627 6613.890137 1
  440.024802 6325.727051 1
  458.090488 13049.238281 2
  482.101522 11013.035156 1
  523.987343 6040.830566 1
  527.181234 4646.505371 1
  529.197155 6605.488281 1
  530.056099 21233.060547 2
  595.150155 11520.698242 1
  612.895696 6351.639648 1
  613.093545 4631.628418 1
  613.113622 19499.097656 2
  613.136569 55868.054688 6
  613.159517 3186660.500000 369
  613.179597 46030.976563 5
  613.185334 46793.789063 5
  613.205416 24005.304688 3
  613.219760 5626.611816 1
  613.426378 6820.694336 1
  614.115859 5409.950195 1
  614.138861 13205.684570 2
  614.161865 752564.062500 87
  614.181995 9463.423828 1
  614.187747 10602.131836 1
  614.207877 5648.860352 1
  615.155144 199467.343750 23
  616.159503 30634.205078 4
  616.171061 5701.842285 1
  635.141374 118486.601563 14
  636.146592 20558.347656 2
  637.117736 14418.181641 2
  637.135967 5293.890137 1
  651.107491 8156.850586 1
  666.072740 34491.750000 4
  667.080687 32082.621094 4
  668.081137 8877.684570 1
  675.084763 15367.359375 2
  747.107553 10505.039063 1
  836.283270 7472.522461 1
  902.234917 9072.836914 1
  920.199079 7036.565918 1
  920.241271 692133.187500 80
  920.278191 8359.660156 1
  920.288741 8047.442383 1
  921.249465 147903.796875 17
  922.243441 42747.062500 5
  923.244328 11685.072266 1
  942.225186 20278.306641 2
  943.225946 8471.807617 1
  973.150937 4582.576172 1
  974.161171 8946.713867 1
  1073.787960 9458.530273 1
  1074.280068 10059.206055 1
  1074.792485 7706.348633 1
  1075.285283 5420.507324 1
  1075.791754 4576.640137 1
  1227.329352 88294.687500 10
  1227.816907 11122.611328 1
  1228.329152 50452.210938 6
  1228.825441 7399.150879 1
  1229.330175 28268.763672 3
  1230.324268 6736.797852 1
  1380.868978 9986.411133 1
  1381.353836 5252.646484 1
  1381.382935 5582.881836 1
  1381.877769 12706.279297 1
  1382.353448 4484.903320 1