ACCESSION: MSBNK-NAIST-KNA00550
RECORD_TITLE: Citric acid; LC-ESI-ITFT; MS; NEG
DATE: 2016.01.19 (Created 2009.11.18, modified 2011.08.03)
AUTHORS: Takahashi H, Kanaya S, Ogasawara N, Graduate School of Information Science, NAIST
LICENSE: CC BY-SA

CH$NAME: Citrate
CH$NAME: Citric acid
CH$NAME: 2-Hydroxy-1,2,3-propanetricarboxylic acid
CH$NAME: 2-Hydroxytricarballylic acid
CH$COMPOUND_CLASS: Natural Product
CH$FORMULA: C6H8O7
CH$EXACT_MASS: 192.02700
CH$SMILES: OC(=O)CC(O)(CC(O)=O)C(O)=O
CH$IUPAC: InChI=1S/C6H8O7/c7-3(8)1-6(13,5(11)12)2-4(9)10/h13H,1-2H2,(H,7,8)(H,9,10)(H,11,12)
CH$LINK: CAS 77-92-9
CH$LINK: CHEBI 30769
CH$LINK: KEGG C00158
CH$LINK: KNAPSACK C00007619
CH$LINK: NIKKAJI J2.824J
CH$LINK: PUBCHEM 3458
CH$LINK: INCHIKEY KRKNYBCHXYNGOX-UHFFFAOYSA-N
CH$LINK: COMPTOX DTXSID3020332

AC$INSTRUMENT: LTQ Orbitrap XL, Thermo Scientfic
AC$INSTRUMENT_TYPE: LC-ESI-ITFT
AC$MASS_SPECTROMETRY: MS_TYPE MS
AC$MASS_SPECTROMETRY: ION_MODE NEGATIVE
AC$MASS_SPECTROMETRY: COLLISION_ENERGY 35eV
AC$MASS_SPECTROMETRY: IONIZATION ESI
AC$CHROMATOGRAPHY: COLUMN_NAME TOSOH TSKgel ODS-100V 5um Part no. 21456
AC$CHROMATOGRAPHY: FLOW_GRADIENT 0min:3%, 45min:97%, 50min:97%, 50.1:3%, 57min:3% (acetonitrile)
AC$CHROMATOGRAPHY: FLOW_RATE 0.5 ml/min
AC$CHROMATOGRAPHY: RETENTION_TIME 9.116215 min
AC$CHROMATOGRAPHY: SOLVENT A 0.1%formate-water
AC$CHROMATOGRAPHY: SOLVENT B 0.1%formate-acetonitrile

MS$FOCUSED_ION: BASE_PEAK 191.019424

PK$SPLASH: splash10-0006-0911200000-af80d22f720facc4813a
PK$NUM_PEAK: 568
PK$PEAK: m/z int. rel.int.
  103.040071 1947.063477 1
  103.383386 958.946777 1
  103.916293 852.213379 1
  103.920296 7774.704102 5
  104.928110 9001.982422 5
  105.935822 1095.061035 1
  108.020314 11205.073242 7
  110.988340 1101.159058 1
  111.004027 1036.409180 1
  111.005131 2257.857178 1
  111.007120 9388.833984 6
  111.008888 198177.046875 120
  111.010656 9976.506836 6
  111.012203 1975.189453 1
  111.013970 1008.824463 1
  111.867229 840.124878 1
  112.012000 7256.008789 4
  112.985421 1361.408203 1
  113.012881 857.531982 1
  113.778734 863.430542 1
  114.951622 9268.550781 6
  118.278774 840.753052 1
  122.012310 824.274902 1
  124.134687 824.464722 1
  126.030708 2321.205811 1
  126.248849 937.555054 1
  127.548437 823.405640 1
  127.956556 885.905884 1
  129.019236 20536.507813 12
  129.021174 2210.829346 1
  130.698078 943.685913 1
  136.010300 829.526978 1
  137.945675 852.011719 1
  138.951479 870.365234 1
  138.979953 2525.567139 2
  139.006887 1566.559448 1
  139.891704 1068.155151 1
  140.966957 3456.808105 2
  141.695474 871.619141 1
  142.890974 1055.283203 1
  142.943589 1333.042480 1
  142.959735 1019.635864 1
  142.965871 2816.095215 2
  143.951448 4799.513672 3
  144.959122 7580.667480 5
  144.996060 1356.946289 1
  145.008266 1427.232422 1
  145.525620 892.603760 1
  145.890482 1902.825195 1
  145.966751 3691.524902 2
  147.029711 4122.591797 3
  148.952461 3023.624512 2
  151.026022 17636.416016 11
  154.037925 872.540771 1
  154.982805 2089.127930 1
  154.998116 8973.681641 5
  155.951123 3364.714355 2
  156.894750 3324.820801 2
  156.959003 14813.716797 9
  158.892611 2232.295654 1
  158.938408 5442.140625 3
  159.893658 5459.840820 3
  160.892241 5639.898926 3
  161.893591 4536.980957 3
  161.961719 8355.652344 5
  161.965224 1122.759155 1
  162.892928 8797.369141 5
  162.971513 937.360107 1
  162.987630 2327.762207 1
  164.589943 888.712769 1
  164.895156 4254.865723 3
  164.950777 962.666626 1
  164.966788 5681.206543 3
  165.204428 832.170410 1
  166.946346 13466.998047 8
  166.974470 1076.785522 1
  167.174393 833.347290 1
  167.946018 978.270264 1
  167.987558 1294.771240 1
  168.943080 1636.745728 1
  169.011969 873.312378 1
  170.003475 905.967651 1
  171.945943 2101.850098 1
  172.953963 2327.942383 1
  173.001673 919.394165 1
  173.008982 11468.414063 7
  173.961769 1260.756104 1
  174.012065 976.883789 1
  177.039946 3803.897949 2
  178.982405 2301.632813 1
  180.930798 1288.496948 1
  180.961608 9009.931641 5
  180.964828 834.986694 1
  180.997947 2166.053467 1
  182.423753 861.644653 1
  182.705243 952.160645 1
  182.977564 1873.394775 1
  183.946104 1288.040405 1
  184.420721 1618.223022 1
  184.976528 1363.015015 1
  185.686300 840.718140 1
  185.997901 1187.826172 1
  188.675288 872.941528 1
  188.998373 904.353882 1
  189.956794 2552.332764 2
  190.881660 3615.500977 2
  190.941963 852.971558 1
  190.944954 1271.140015 1
  190.973371 8615.673828 5
  190.983344 1724.665283 1
  190.984840 2014.112305 1
  190.988331 2252.759521 1
  190.991821 1274.809326 1
  190.994315 1343.947510 1
  190.995811 1949.387451 1
  190.997307 1692.374146 1
  190.999800 3084.118652 2
  191.001795 2046.686279 1
  191.003790 1050.824463 1
  191.005785 3749.429443 2
  191.008279 4562.532715 3
  191.009775 3825.400391 2
  191.011271 15209.202148 9
  191.015261 54311.027344 33
  191.019252 1644615.375000 999
  191.023242 63525.148438 39
  191.027233 16980.773438 10
  191.029228 1885.272949 1
  191.031223 5782.005371 4
  191.032720 2948.710449 2
  191.038207 2987.005615 2
  191.041200 1994.695068 1
  191.046189 1962.455078 1
  191.048185 1677.884766 1
  191.050180 2057.309326 1
  191.053174 1634.873657 1
  191.065149 8119.669922 5
  191.157491 3591.988281 2
  191.239408 861.020020 1
  192.018741 2154.845947 1
  192.022763 73986.390625 45
  192.026282 2944.973633 2
  192.961258 852.334717 1
  193.023055 11281.398438 7
  194.026589 1323.184570 1
  195.046203 885.630859 1
  195.050321 1476.901733 1
  195.982095 1662.048218 1
  196.364161 968.891479 1
  196.993674 1392.593628 1
  198.969398 2022.032471 1
  198.982124 1334.412720 1
  199.000686 2064.000977 1
  199.940646 15105.173828 9
  200.936243 884.324951 1
  200.948621 11054.797852 7
  202.924205 1375.854980 1
  204.998366 1068.610229 1
  206.960976 1079.877930 1
  206.977290 9669.471680 6
  208.956471 9794.310547 6
  209.838658 938.149658 1
  210.751875 825.919922 1
  210.935812 1165.599487 1
  211.977439 2002.983398 1
  212.914647 920.652222 1
  212.971007 4413.844238 3
  212.984513 2501.724854 2
  213.000957 1847.982422 1
  213.413265 886.125488 1
  213.992865 10305.598633 6
  216.019176 2470.763916 2
  217.015354 8386.733398 5
  217.950945 3614.575928 2
  218.958695 3033.583740 2
  219.336256 837.188477 1
  220.575667 833.840454 1
  220.650576 865.387329 1
  220.992794 3025.930420 2
  226.948025 1553.343140 1
  226.964175 1465.993774 1
  228.937585 1252.918701 1
  228.943475 36926.843750 22
  229.010901 4506.597656 3
  229.052157 962.277222 1
  229.946801 3172.501221 2
  230.551437 864.142456 1
  232.964423 823.450317 1
  232.987938 5576.969238 3
  234.971861 7423.240723 5
  238.894362 1137.688477 1
  238.904129 889.457397 1
  239.971608 2872.766113 2
  244.938436 6469.809082 4
  245.946796 2394.223145 1
  246.935733 2078.944580 1
  247.938024 1226.394043 1
  248.938266 3921.482910 2
  248.987991 6701.187500 4
  250.941221 2500.325195 2
  250.950985 2542.861572 2
  251.949888 2850.155273 2
  252.946406 35940.726563 22
  253.918267 889.020996 1
  253.948083 2065.249268 1
  254.942647 2530.206787 2
  255.987166 1629.509766 1
  257.006200 3749.930176 2
  257.975740 825.077393 1
  257.982785 34042.378906 21
  257.985917 1187.579102 1
  258.984633 2272.654785 1
  259.021646 24387.621094 15
  260.968475 847.979736 1
  261.941319 1724.013672 1
  272.933087 1064.956177 1
  274.998656 876.014526 1
  275.009857 1501.940430 1
  275.016751 68043.257813 41
  275.021059 1222.259155 1
  275.023644 2267.089844 1
  276.019884 3186.944824 2
  276.928362 1087.985840 1
  278.962059 6175.710449 4
  279.672034 882.297119 1
  279.964749 1664.419434 1
  280.859882 3275.097900 2
  280.982642 894.234497 1
  281.966733 1316.606079 1
  282.322200 832.090576 1
  283.954105 1217.336792 1
  283.962241 35796.175781 22
  284.964768 2474.250488 2
  285.254909 973.728882 1
  285.941550 1776.417480 1
  286.964688 947.588989 1
  288.986665 4638.321777 3
  292.960690 2073.227539 1
  292.966375 1012.026123 1
  292.977744 2175.625977 1
  293.996051 2796.698730 2
  294.992872 8243.179688 5
  295.938015 871.520142 1
  295.992847 845.169189 1
  296.998883 5781.602051 4
  298.870154 1629.668091 1
  301.003704 1116.067139 1
  301.971956 8505.558594 5
  302.992711 3029.381592 2
  310.161272 863.575562 1
  310.967809 3916.963867 2
  312.899648 1182.840942 1
  312.954032 1534.442261 1
  314.898103 1412.175537 1
  314.943505 7067.283691 4
  315.898154 2170.861816 1
  316.897647 2412.529297 1
  316.983995 851.540161 1
  318.898004 2619.977051 2
  319.909617 2135.366943 1
  320.956467 2463.667236 1
  321.954976 2283.790283 1
  322.942802 913.157227 1
  322.951574 37830.410156 23
  323.950603 2081.023438 1
  323.955009 4239.858887 3
  324.948741 2352.081787 1
  324.962021 1021.784058 1
  325.182377 1245.517578 1
  327.951915 2524.342529 2
  328.097832 844.573120 1
  328.934802 1193.120239 1
  329.943627 1030.533813 1
  330.919565 1307.231445 1
  331.946682 7830.281738 5
  331.958109 950.661987 1
  332.902836 1949.610352 1
  332.954483 23295.382813 14
  333.957656 1237.542358 1
  334.954946 1153.381348 1
  334.958420 998.087891 1
  336.966480 1501.388184 1
  338.742798 877.818726 1
  338.982038 1123.601807 1
  341.897871 2068.429199 1
  341.907427 1109.622192 1
  342.904571 1583.953247 1
  345.962434 3485.387695 2
  346.893142 897.845459 1
  354.936596 1824.029053 1
  359.001304 6912.025391 4
  360.886264 1556.880615 1
  363.966545 1004.179443 1
  364.961674 1869.966553 1
  367.943666 1539.096924 1
  368.799893 831.851318 1
  372.288791 874.236572 1
  378.840755 956.639893 1
  378.896485 8602.106445 5
  380.982653 1376.639404 1
  383.035106 2313.514893 1
  383.046437 109105.507813 66
  383.057768 2589.982910 2
  384.049782 11939.899414 7
  385.049938 2573.368408 2
  390.035575 3787.092773 2
  391.031461 14458.728516 9
  391.893351 1196.612183 1
  391.968114 12672.761719 8
  392.035566 2034.068359 1
  392.971416 1965.392334 1
  396.908333 978.584106 1
  396.972581 1127.505005 1
  400.956279 1471.461182 1
  405.015647 3755.839355 2
  405.027967 127464.195313 77
  405.035668 1537.027222 1
  405.040288 3420.945801 2
  406.030847 11203.208008 7
  406.990915 11036.913086 7
  407.003325 16599.482422 10
  407.032802 1738.937012 1
  407.994871 906.110718 1
  408.007327 2080.677246 1
  408.952542 3719.381592 2
  409.955928 1190.751953 1
  411.913783 1236.220459 1
  413.949337 2132.752686 1
  417.946491 1325.403076 1
  418.955636 2034.446289 1
  420.993080 15049.435547 9
  421.001240 2728.059326 2
  421.037147 1666.685059 1
  421.995268 1983.334961 1
  422.996109 1417.189941 1
  424.967119 5648.250000 3
  425.001879 2180.983154 1
  425.965268 6419.412109 4
  426.021747 959.155029 1
  426.948604 1969.331543 1
  426.961938 93118.390625 57
  426.975273 2343.554443 1
  426.995276 1262.219238 1
  427.008613 19601.804688 12
  427.960437 4596.992676 3
  427.967128 7056.433105 4
  428.013968 2734.008301 2
  428.959086 5119.997070 3
  428.985944 4451.453613 3
  429.922496 1218.001587 1
  429.988187 898.578979 1
  431.286545 878.755005 1
  433.962446 5294.157227 3
  434.965049 1539.338989 1
  434.970191 854.116333 1
  435.929857 1207.964844 1
  435.943614 2921.997559 2
  435.957372 136821.812500 83
  435.965971 2801.306152 2
  435.971130 3349.650635 2
  436.953094 2572.872803 2
  436.965174 56061.449219 34
  437.967816 5907.199219 4
  442.302932 828.335938 1
  442.975040 2654.691406 2
  443.019080 2402.688232 1
  443.947197 962.678955 1
  443.977241 1061.959839 1
  446.948990 1847.657959 1
  447.948595 2657.905029 2
  447.957551 1697.584961 1
  448.924599 960.928345 1
  448.944367 20501.933594 12
  448.991097 1689.442871 1
  449.948873 1329.671997 1
  450.920573 845.115479 1
  450.942282 1878.221191 1
  451.049043 3704.144775 2
  451.993446 1145.842041 1
  453.944157 1245.936768 1
  457.939194 13342.835938 8
  457.948451 854.648804 1
  458.946194 11203.844727 7
  459.941609 917.604614 1
  459.949064 1509.894531 1
  467.043050 2699.881104 2
  473.030613 10799.235352 7
  473.949391 2240.425293 1
  479.874005 3696.983398 2
  480.882526 3443.766846 2
  480.928353 1646.224121 1
  488.868253 1252.689941 1
  489.025537 5104.105957 3
  489.876595 2493.145020 2
  489.993379 1145.372192 1
  490.028218 1205.607056 1
  494.867633 1081.768311 1
  494.965401 4958.458984 3
  495.013256 1656.390015 1
  495.967632 1050.507446 1
  497.735693 900.133667 1
  502.864671 2041.636475 1
  503.959392 10390.170898 6
  504.926907 1233.365723 1
  504.967638 4557.072754 3
  505.970311 1200.528564 1
  506.926374 1274.436035 1
  507.926238 912.032104 1
  508.924726 2402.412109 1
  510.926190 2737.830811 2
  510.961102 2051.644043 1
  511.006930 825.386841 1
  512.985578 1134.137085 1
  513.908774 2185.733887 1
  513.932986 3159.200195 2
  513.950596 111399.140625 68
  513.961603 2612.678223 2
  513.968207 2261.029297 1
  514.953662 12519.670898 8
  515.955239 2443.469971 1
  519.051285 1504.949585 1
  519.955068 5459.239746 3
  520.055883 964.248291 1
  520.962293 2944.378174 2
  522.112165 901.994263 1
  526.909854 901.565308 1
  530.908546 1069.057373 1
  531.961689 35869.695313 22
  532.906388 1135.679443 1
  532.964499 4084.686035 2
  535.046446 1026.177734 1
  539.034246 885.973511 1
  540.907007 1239.285400 1
  542.904243 14313.221680 9
  542.944874 999.463867 1
  554.975057 917.285278 1
  557.028434 1241.904785 1
  559.955905 11154.130859 7
  560.961123 1702.762451 1
  564.010786 1155.987183 1
  570.998916 935.143921 1
  575.072933 2521.819580 2
  597.053654 7320.002930 4
  598.058200 2600.763672 2
  599.056973 923.393188 1
  600.341614 7543.974609 5
  601.340543 38685.394531 23
  602.344760 8836.595703 5
  603.334695 2079.645996 1
  609.937300 2174.422852 1
  613.019724 2015.303223 1
  618.987322 2249.992676 1
  618.998961 1339.960205 1
  619.036787 5424.541504 3
  620.041920 1565.568115 1
  621.011490 1211.493652 1
  626.011978 1026.094971 1
  627.984497 4928.828613 3
  628.993627 4570.634766 3
  629.993241 1312.525269 1
  640.970219 3862.696777 2
  641.019276 1250.402710 1
  646.263864 1930.609619 1
  649.967205 4982.995117 3
  650.973319 3137.905762 2
  659.206119 1177.404541 1
  662.905324 1417.650391 1
  662.953696 1489.173462 1
  665.058148 1304.305298 1
  669.935599 917.416138 1
  671.902272 2624.419922 2
  671.948341 2795.550049 2
  672.910293 1713.337158 1
  681.023188 972.835938 1
  681.050050 1527.208862 1
  681.903762 2149.953857 1
  681.934041 1113.117676 1
  682.351424 1096.524780 1
  686.995262 1480.245361 1
  690.547031 844.266235 1
  695.988992 3849.997070 2
  696.996094 1426.782104 1
  703.655808 949.920654 1
  703.885085 1765.923096 1
  705.918196 1473.627075 1
  705.946545 1417.811157 1
  705.978439 89900.257813 55
  706.006791 1626.004883 1
  706.982447 14469.733398 9
  707.981481 2752.392822 2
  717.969406 1085.436401 1
  718.980900 1064.710205 1
  727.958633 5940.787598 4
  734.932592 7687.363281 5
  735.934892 2000.693848 1
  746.017773 871.387085 1
  747.328388 1035.748901 1
  759.897968 1134.732056 1
  786.870006 876.154663 1
  789.080681 1081.213135 1
  789.973433 1411.626343 1
  803.458202 873.277222 1
  803.944633 1018.163086 1
  809.324658 2737.978516 2
  832.995062 976.688232 1
  841.992690 1248.683105 1
  842.999875 1195.032593 1
  851.441914 850.910400 1
  854.638039 997.032104 1
  864.983628 2213.006592 1
  871.285294 998.969849 1
  873.929702 1362.858032 1
  884.315556 1026.347412 1
  886.959662 1009.099121 1
  887.638779 833.286743 1
  896.919247 1143.067261 1
  898.006271 12243.856445 7
  899.008691 2992.886230 2
  899.727190 908.240356 1
  905.974967 2650.901123 2
  911.700062 824.451050 1
  912.511945 883.346924 1
  919.983919 2599.752441 2
  937.051109 1007.410767 1
  955.155149 835.884277 1
  966.005026 1462.932129 1
  973.289675 874.754639 1
  1005.969235 10763.257813 7
  1006.976678 2820.207275 2
  1065.994028 1367.356323 1
  1087.019637 833.493530 1
  1098.808293 841.256836 1
  1105.916791 986.552612 1
  1105.965432 14365.285156 9
  1106.966746 3796.535645 2
  1108.854856 864.165283 1
  1109.608659 965.354248 1
  1144.919814 857.117798 1
  1155.955800 891.216675 1
  1165.985321 11096.545898 7
  1166.986407 3616.162598 2
  1167.996325 988.045776 1
  1178.374334 892.171143 1
  1182.980837 1000.320801 1
  1189.542114 888.599365 1
  1205.956640 6692.414551 4
  1206.970043 1776.152344 1
  1243.168748 1143.369751 1
  1256.811588 838.521973 1
  1257.257858 934.473511 1
  1265.978062 31407.583984 19
  1266.982865 8147.910156 5
  1267.988864 1125.483276 1
  1290.182318 905.049438 1
  1322.397964 896.116699 1
  1322.643304 842.811523 1
  1324.043957 835.693970 1
  1333.975554 1128.819946 1
  1352.690616 916.365234 1
  1365.974981 17423.640625 11
  1366.977040 3572.313477 2
  1382.957032 1068.355957 1
  1415.739060 987.385498 1
  1453.682077 884.074829 1
  1465.969084 9221.317383 6
  1466.977026 2203.053955 1
  1467.975382 1423.153564 1
  1499.206719 862.913086 1