ACCESSION: MSBNK-NAIST-KNA00632
RECORD_TITLE: L-Tryptophan; LC-ESI-ITFT; MS; NEG
DATE: 2016.01.19 (Created 2009.11.19, modified 2011.08.03)
AUTHORS: Takahashi H, Kanaya S, Ogasawara N, Graduate School of Information Science, NAIST
LICENSE: CC BY-SA

CH$NAME: L-Tryptophan
CH$NAME: Tryptophan
CH$NAME: (S)-alpha-Amino-beta-(3-indolyl)-propionic acid
CH$COMPOUND_CLASS: Natural Product
CH$FORMULA: C11H12N2O2
CH$EXACT_MASS: 204.08988
CH$SMILES: C1=CC=C2C(=C1)C(=CN2)C[C@@H](C(=O)O)N
CH$IUPAC: InChI=1S/C11H12N2O2/c12-9(11(14)15)5-7-6-13-10-4-2-1-3-8(7)10/h1-4,6,9,13H,5,12H2,(H,14,15)/t9-/m0/s1
CH$LINK: CAS 73-22-3
CH$LINK: CHEBI 16828
CH$LINK: KEGG C00078
CH$LINK: KNAPSACK C00001396
CH$LINK: NIKKAJI J9.181B
CH$LINK: PUBCHEM CID:6305
CH$LINK: INCHIKEY QIVBCDIJIAJPQS-VIFPVBQESA-N
CH$LINK: COMPTOX DTXSID5021419

AC$INSTRUMENT: LTQ Orbitrap XL, Thermo Scientfic
AC$INSTRUMENT_TYPE: LC-ESI-ITFT
AC$MASS_SPECTROMETRY: MS_TYPE MS
AC$MASS_SPECTROMETRY: ION_MODE NEGATIVE
AC$MASS_SPECTROMETRY: COLLISION_ENERGY 35eV
AC$MASS_SPECTROMETRY: IONIZATION ESI
AC$CHROMATOGRAPHY: COLUMN_NAME TOSOH TSKgel ODS-100V 5um Part no. 21456
AC$CHROMATOGRAPHY: FLOW_GRADIENT 0min:3%, 45min:97%, 50min:97%, 50.1:3%, 57min:3% (acetonitrile)
AC$CHROMATOGRAPHY: FLOW_RATE 0.5 ml/min
AC$CHROMATOGRAPHY: RETENTION_TIME 13.942213 min
AC$CHROMATOGRAPHY: SOLVENT A 0.1%formate-water
AC$CHROMATOGRAPHY: SOLVENT B 0.1%formate-acetonitrile

MS$FOCUSED_ION: BASE_PEAK 203.081818

PK$SPLASH: splash10-0udi-0290601010-9cbb6e448846da62e769
PK$NUM_PEAK: 807
PK$PEAK: m/z int. rel.int.
  102.047391 801.646851 1
  102.806104 888.760132 1
  103.767951 770.097168 1
  104.351553 753.011597 1
  105.248469 824.553711 1
  105.935822 939.689087 1
  106.053958 748.267578 1
  106.325615 927.953857 1
  107.680048 743.271240 1
  108.130908 819.347046 1
  111.765141 920.831177 1
  111.928057 873.562134 1
  112.169172 879.383301 1
  112.980202 1104.841919 1
  112.981790 1646.514526 1
  112.983606 4087.262451 3
  112.985648 115311.156250 83
  112.987463 4876.036133 3
  112.989278 1340.694092 1
  114.951622 2291.393066 2
  116.044429 1093.836548 1
  116.046790 2587.157715 2
  116.048680 5990.525391 4
  116.050569 157535.390625 113
  116.052695 6675.657227 5
  116.054349 2189.516602 2
  116.557923 700.249756 1
  117.053774 5209.939453 4
  117.099727 773.827148 1
  117.766916 821.789551 1
  118.622193 796.320801 1
  118.965885 906.986450 1
  119.325848 750.687012 1
  119.770611 811.932617 1
  121.867301 751.282837 1
  122.458109 705.850830 1
  122.671144 855.737061 1
  124.426551 771.927246 1
  126.240810 798.621582 1
  126.843771 858.145630 1
  128.831443 734.197021 1
  129.058284 1197.313232 1
  129.638611 731.966797 1
  129.789891 803.898926 1
  129.882968 725.164795 1
  130.066059 5393.148438 4
  132.078335 821.958984 1
  132.210640 736.984619 1
  134.047025 3535.676025 3
  134.179363 781.374268 1
  138.203160 922.730469 1
  138.968810 795.308472 1
  139.004101 861.371826 1
  139.006578 2972.671387 2
  141.709178 738.994385 1
  142.059773 1237.585205 1
  142.065852 46096.378906 33
  142.068411 1546.177856 1
  142.509331 821.470947 1
  142.946173 902.255859 1
  143.069275 2617.337158 2
  145.049843 1280.742554 1
  146.803623 710.749023 1
  146.965398 1300.275635 1
  147.378274 796.955688 1
  148.832666 865.499146 1
  148.850849 842.108032 1
  148.952461 1452.271851 1
  149.473475 901.770020 1
  149.814139 785.397827 1
  153.647134 799.022461 1
  153.962102 1138.504517 1
  155.717739 996.372314 1
  155.989764 972.498169 1
  156.068932 1087.976196 1
  156.707787 784.011230 1
  157.076841 7360.388672 5
  157.079073 841.925537 1
  157.520384 752.747925 1
  157.806512 788.538208 1
  158.447032 765.730103 1
  159.078571 770.809448 1
  159.092219 15076.739258 11
  159.816143 821.890625 1
  161.910327 827.676270 1
  164.716479 777.492920 1
  165.020042 832.274292 1
  165.095763 799.868774 1
  168.055040 771.491821 1
  169.721567 903.474854 1
  170.940799 817.243774 1
  170.943754 937.748169 1
  170.992325 727.988037 1
  172.912716 712.691772 1
  175.857619 985.844849 1
  176.718613 761.682129 1
  180.853576 875.505127 1
  181.957283 893.066895 1
  183.736065 841.387817 1
  184.381927 1884.604492 1
  185.071627 918.853394 1
  186.055424 7374.263672 5
  187.058688 1162.451904 1
  190.282681 783.499268 1
  192.062484 818.571289 1
  195.050321 1258.225708 1
  197.962578 2160.231445 2
  201.679306 949.862183 1
  202.316085 822.213989 1
  202.845584 1036.705688 1
  202.930759 3041.860107 2
  203.031291 5234.730469 4
  203.035663 1173.334961 1
  203.053702 1803.700928 1
  203.056982 1183.797485 1
  203.061355 2485.181641 2
  203.063542 1492.343872 1
  203.067369 6257.461914 4
  203.069009 6266.255859 4
  203.072836 20160.759766 14
  203.075023 32360.072266 23
  203.077210 42444.750000 30
  203.081585 1393463.250000 999
  203.086506 43384.425781 31
  203.088693 2674.257813 2
  203.090880 16538.236328 12
  203.093614 3985.001709 3
  203.095801 6122.546875 4
  203.099082 2314.604492 2
  203.101270 2477.043457 2
  203.110020 2053.276855 1
  203.113301 1319.365479 1
  203.115489 1507.623657 1
  203.132444 5320.806641 4
  203.233126 2248.915527 2
  203.333334 1204.078979 1
  204.074323 979.265991 1
  204.075975 1351.692139 1
  204.079280 7200.877930 5
  204.085339 138527.921875 99
  204.089746 4861.233398 3
  204.094153 1488.387207 1
  205.082127 2013.039307 1
  205.086011 4043.538818 3
  205.088230 6221.409180 4
  205.567947 911.129761 1
  207.739436 847.734985 1
  208.807605 708.143433 1
  210.337453 763.839478 1
  210.384144 877.729492 1
  210.982702 836.499756 1
  213.010941 1634.900879 1
  214.616405 832.461792 1
  217.399403 784.912964 1
  220.005507 945.214111 1
  222.614821 783.469482 1
  223.369138 795.353394 1
  225.054438 914.568604 1
  225.056352 1498.062134 1
  225.064007 38803.054688 28
  225.894948 895.543945 1
  226.050259 782.632813 1
  226.061175 786.250000 1
  226.066955 3919.851318 3
  226.977741 1471.522217 1
  228.013687 5946.740234 4
  229.006318 1195.350464 1
  229.932309 792.173950 1
  230.517049 879.758545 1
  235.071245 1043.355347 1
  237.014320 4615.306641 3
  239.040228 884.858521 1
  239.047211 1894.125977 1
  239.052797 4584.483398 3
  239.054892 1722.287109 1
  239.058384 128300.609375 92
  239.063971 3567.229980 3
  239.070256 976.871094 1
  240.008134 864.114014 1
  240.061532 12065.161133 9
  240.607072 837.088135 1
  241.049794 1049.877441 1
  241.055451 31335.121094 22
  241.097882 777.264771 1
  242.058402 4594.722656 3
  243.170040 1126.461304 1
  244.370168 966.405518 1
  246.283813 850.172119 1
  246.680071 846.979004 1
  248.959787 8081.389648 6
  249.087487 3775.544189 3
  250.339226 815.218262 1
  250.739315 837.281128 1
  251.513737 763.730103 1
  253.437354 831.804932 1
  255.024188 1785.285156 1
  255.881189 922.609375 1
  256.141222 853.922241 1
  257.284323 762.708252 1
  259.016920 8259.433594 6
  260.020050 1563.755493 1
  260.394353 820.133911 1
  261.033800 1008.236572 1
  261.040174 51422.753906 37
  261.044158 1761.187012 1
  262.043872 4015.073975 3
  263.037249 14983.748047 11
  264.041149 2381.197998 2
  266.076927 17300.525391 12
  267.080153 1224.687256 1
  269.590600 700.444702 1
  271.056722 1269.638428 1
  271.061781 1260.463989 1
  271.069369 61865.414063 44
  271.076115 1607.226685 1
  272.072160 4421.243164 3
  272.956090 1117.044800 1
  273.724511 779.415283 1
  274.003651 1861.304199 1
  274.536569 827.047485 1
  275.011581 2065.203857 1
  277.004997 1250.891968 1
  283.019861 6588.543945 5
  284.918422 734.559814 1
  287.033583 6455.921875 5
  287.601297 767.056396 1
  288.059822 14692.372070 11
  289.062788 1415.476807 1
  292.977744 7263.490234 5
  293.050710 1300.904419 1
  293.116119 792.181519 1
  293.980813 1501.084473 1
  293.985575 1711.749268 1
  294.604618 795.370850 1
  294.974685 1998.199707 1
  296.996949 968.900269 1
  298.557050 831.056641 1
  299.069392 2057.954346 1
  300.972134 918.712891 1
  300.980026 915.309326 1
  301.011597 1242.349731 1
  301.030345 3244.020264 2
  302.976769 886.600098 1
  303.006662 10827.444336 8
  303.814447 879.494141 1
  304.009637 1894.585938 1
  304.014644 3231.839844 2
  304.848588 908.608765 1
  311.002001 919.320923 1
  311.014436 2964.029053 2
  315.095620 2101.565430 2
  317.074645 21064.035156 15
  318.066870 848.569946 1
  318.077588 1895.974121 1
  319.050840 5256.347656 4
  323.030536 1325.963867 1
  323.040408 933.357422 1
  326.022667 954.873779 1
  328.043944 2476.791260 2
  328.116921 918.705200 1
  328.566546 849.013916 1
  328.953964 9153.415039 7
  329.024989 16154.885742 12
  330.017238 1687.121948 1
  330.028566 1997.886475 1
  330.951412 3720.272949 3
  332.032396 1353.951904 1
  333.039439 2630.649170 2
  333.054367 1137.864502 1
  338.945487 1318.938232 1
  338.983217 1243.070679 1
  339.056336 7505.480469 5
  339.077569 945.742188 1
  339.819600 707.823364 1
  339.862211 972.361206 1
  340.041026 3365.025635 2
  341.043100 1075.097290 1
  341.690142 743.462158 1
  343.050977 896.272339 1
  345.755848 767.626953 1
  345.972160 1806.388428 1
  346.054849 4385.204102 3
  346.971277 1528.052734 1
  347.032339 945.078979 1
  348.885256 840.047363 1
  348.971455 1864.925049 1
  349.012103 2838.902344 2
  355.040215 1498.771362 1
  355.264034 817.063965 1
  357.020166 5086.960938 4
  357.087724 885.949097 1
  357.944698 786.337646 1
  360.996387 2892.926514 2
  367.225993 870.727417 1
  369.997725 789.472412 1
  370.993406 1155.068481 1
  372.590257 776.858765 1
  377.087360 854.328857 1
  378.896485 3753.537354 3
  388.075403 840.448853 1
  394.084972 870.184082 1
  394.342278 879.938599 1
  402.011062 2332.823975 2
  405.155820 1284.461304 1
  407.029699 1479.499390 1
  407.130563 1278.522217 1
  407.135219 1748.976074 1
  407.146083 4485.058594 3
  407.153844 2107.849854 2
  407.158501 8843.522461 6
  407.170919 531851.562500 381
  407.184889 11391.715820 8
  407.197309 4464.371094 3
  407.211281 1708.435669 1
  407.315318 1299.140747 1
  408.010441 1404.793701 1
  408.149056 1171.514648 1
  408.173983 127137.468750 91
  408.188005 2534.533936 2
  408.200470 1007.422119 1
  409.177631 8452.315430 6
  409.199524 923.718262 1
  410.429942 851.227417 1
  412.060713 941.216064 1
  415.533928 1014.185181 1
  418.992902 1119.326294 1
  424.185318 985.621094 1
  426.021747 3585.930176 3
  427.061964 1251.219727 1
  429.108513 1097.539795 1
  429.125308 3383.522705 2
  429.138744 8863.953125 6
  429.153861 450435.718750 323
  429.167298 9872.443359 7
  429.180736 3898.480713 3
  429.195855 1487.060425 1
  429.239536 900.234009 1
  429.617823 1030.942017 1
  430.141523 2075.809570 1
  430.156692 101421.000000 73
  430.170177 2339.738770 2
  430.948305 971.491089 1
  431.129214 32238.732422 23
  431.159658 9034.269531 6
  432.132191 5480.552734 4
  432.244227 1065.209229 1
  433.012670 1156.227783 1
  433.527242 860.724243 1
  437.084273 2281.033447 2
  443.147713 22893.623047 16
  444.150500 5161.212891 4
  445.119434 6489.693359 5
  445.126531 7344.029297 5
  445.146049 4909.242188 4
  446.121804 1892.079346 1
  447.123992 1190.091797 1
  451.135928 11440.904297 8
  452.138722 3356.154053 2
  453.250585 895.759766 1
  455.097538 1401.105469 1
  459.094835 1703.703857 1
  461.074916 1275.759399 1
  461.089880 46079.054688 33
  461.106716 1401.693970 1
  461.968446 964.494263 1
  462.092283 8562.643555 6
  462.099790 7041.320313 5
  463.090428 2056.315674 1
  463.103608 1343.296143 1
  465.086969 1238.588745 1
  465.130556 2653.455322 2
  466.214632 869.037109 1
  466.789529 737.249023 1
  467.102171 1822.520508 1
  468.103206 2186.441162 2
  469.084429 1899.199951 1
  469.097865 33188.441406 24
  470.103400 5388.810547 4
  471.094785 2799.411133 2
  475.146637 2938.177002 2
  477.135085 2427.927490 2
  481.095776 1196.803711 1
  483.603585 898.058960 1
  487.112653 9220.151367 7
  488.115566 1869.527100 1
  489.109317 3396.933350 2
  491.124449 6321.770508 5
  492.127406 1704.666382 1
  495.071523 2808.437012 2
  495.113148 794.232178 1
  496.059464 1812.808594 1
  497.067115 42553.312500 31
  497.140404 12189.904297 9
  498.071538 8978.524414 6
  498.145050 2066.583252 1
  499.064265 9449.678711 7
  500.793870 950.781372 1
  502.094323 1771.823486 1
  502.558022 724.826294 1
  503.084182 1020.986816 1
  503.092710 765.727661 1
  504.939769 19411.240234 14
  505.061981 2699.699951 2
  505.074848 2267.620850 2
  505.100583 1750.748047 1
  505.476116 824.129028 1
  505.942359 1398.995483 1
  506.088595 1997.392822 1
  506.099350 876.826172 1
  507.057936 2809.901123 2
  507.096768 16586.509766 12
  507.146392 1122.306274 1
  508.099301 5143.540039 4
  509.202485 954.263428 1
  509.802179 925.370728 1
  510.551107 878.862183 1
  511.587953 753.025269 1
  513.108527 1694.593262 1
  515.103823 17239.128906 12
  516.108053 4121.610352 3
  517.099672 1517.360596 1
  521.160043 4326.159180 3
  522.164010 1913.392578 1
  522.818370 751.138794 1
  522.949390 10824.835938 8
  523.141491 4299.022461 3
  524.142123 1506.688843 1
  527.115573 847.058838 1
  529.943797 1115.854492 1
  530.259704 773.849121 1
  530.885435 838.152100 1
  532.583469 1632.712280 1
  533.415757 830.056396 1
  533.893226 5444.459961 4
  534.450695 862.224121 1
  541.118600 3030.146729 2
  541.216118 1007.385986 1
  542.968777 807.371826 1
  544.489844 790.871704 1
  546.106511 1028.019287 1
  548.098699 4319.078125 3
  549.103745 1408.491821 1
  552.086507 731.745605 1
  553.331174 793.347412 1
  559.110711 869.243896 1
  563.302871 1284.719971 1
  565.085314 2531.117188 2
  569.468194 927.419189 1
  575.083355 2533.227051 2
  582.563074 823.994507 1
  583.089424 2041.998047 1
  584.093590 1115.103882 1
  591.802038 779.644531 1
  596.497277 906.161377 1
  598.315262 831.746704 1
  599.994382 977.014282 1
  604.686501 866.424805 1
  611.259972 58115.812500 42
  611.274248 1591.490112 1
  611.285670 1181.039185 1
  612.266251 18537.435547 13
  613.266408 1810.038330 1
  620.018584 3177.751709 2
  620.313287 846.619873 1
  622.024369 1057.749390 1
  630.163562 863.586426 1
  633.244195 17837.912109 13
  634.232839 2759.223877 2
  634.247927 5606.939453 4
  635.217750 5841.318359 4
  636.223148 2014.048828 1
  637.006100 896.545288 1
  640.112629 791.131714 1
  641.028475 831.385010 1
  649.207119 15776.792969 11
  650.211467 4043.816162 3
  650.383785 805.202515 1
  651.215008 1335.859009 1
  654.669799 799.683228 1
  655.198627 1134.225098 1
  655.223976 50545.015625 36
  656.229620 16359.747070 12
  657.231214 1494.372070 1
  659.500403 830.982300 1
  660.176080 1416.098999 1
  661.688097 847.500854 1
  663.185954 5288.803711 4
  664.174417 9305.909180 7
  664.190587 1432.635376 1
  664.459090 960.289307 1
  665.181298 107163.257813 77
  665.207229 1499.126953 1
  666.183973 36537.542969 26
  667.188916 4019.378662 3
  669.176201 1992.751709 1
  671.192090 3070.812744 2
  672.191928 5166.550781 4
  672.534491 816.581787 1
  673.187402 45522.632813 33
  674.191703 16382.342773 12
  675.181680 2520.223145 2
  675.194939 2707.085205 2
  677.168187 797.122559 1
  677.208140 1187.527344 1
  681.224695 11424.831055 8
  682.230209 4027.584229 3
  685.077170 725.287354 1
  687.161989 4059.046143 3
  688.163628 1787.311523 1
  689.423890 756.999023 1
  691.796660 763.344727 1
  695.171030 1962.772461 1
  695.808639 882.752197 1
  700.149541 1898.231201 1
  703.948597 951.426880 1
  706.184033 1930.676025 1
  707.184927 1189.409302 1
  709.029002 11746.989258 8
  709.146726 1359.993408 1
  710.032378 2342.861816 2
  710.175381 1717.243408 1
  713.184843 2572.957031 2
  713.350396 1419.018311 1
  715.182518 1427.032104 1
  717.152314 1113.944946 1
  722.134550 809.312012 1
  723.140166 4706.196289 3
  723.209976 2084.048584 1
  724.140520 1964.135986 1
  725.220432 926.678589 1
  725.249951 1470.540649 1
  730.533276 1163.528564 1
  731.011008 1013.167603 1
  731.145454 1031.984863 1
  731.205220 1299.722778 1
  732.211132 1101.471436 1
  733.166609 5840.522461 4
  734.172814 1815.814697 1
  736.157484 889.956787 1
  737.983528 3335.846436 2
  739.326188 851.066284 1
  741.175478 2069.086426 1
  742.068353 2591.765137 2
  743.180975 1016.619873 1
  743.855116 845.487549 1
  746.210294 1010.888550 1
  750.938778 844.172607 1
  765.021139 949.456543 1
  770.131687 1409.117554 1
  771.134047 1295.854492 1
  780.017602 857.624878 1
  782.013486 1286.632568 1
  784.149778 24519.271484 18
  785.154699 6885.897461 5
  786.153224 1031.359497 1
  789.022055 1481.378784 1
  789.055555 24818.082031 18
  789.558303 10261.213867 7
  790.057337 6331.515625 5
  790.556844 1186.906616 1
  793.483618 885.680664 1
  798.541331 1291.736450 1
  799.036105 3161.465332 2
  799.125725 764.462280 1
  799.535610 2408.256104 2
  800.052685 866.472290 1
  801.049789 1130.101318 1
  801.152601 1067.990967 1
  801.628363 871.131470 1
  802.615527 855.662109 1
  803.531354 5344.294922 4
  804.035081 4826.750000 3
  805.531829 1079.134155 1
  806.132563 906.347534 1
  808.042945 1055.051392 1
  816.021368 697.799561 1
  816.858783 851.664307 1
  819.015534 1074.741089 1
  819.995071 1773.458252 1
  820.496599 2936.535645 2
  820.994143 12627.044922 9
  821.118600 758.920532 1
  821.496589 7112.640625 5
  821.995043 4305.900391 3
  822.489494 1601.863159 1
  822.997773 1938.455566 1
  826.335542 845.125366 1
  826.771033 1036.332275 1
  826.842899 816.208496 1
  829.003262 6509.416992 5
  829.504051 6034.080078 4
  829.964636 932.676880 1
  830.000776 25751.654297 18
  830.402999 775.944458 1
  830.457253 875.961792 1
  830.502470 18361.171875 13
  831.000092 11893.704102 9
  831.452865 1110.290405 1
  831.498162 4605.541016 3
  832.073764 1770.567871 1
  832.500185 1051.772461 1
  837.331535 2056.001221 1
  837.510094 1549.724609 1
  838.004862 10602.419922 8
  838.504657 13779.216797 10
  838.720302 877.353149 1
  839.004898 48984.277344 35
  839.308015 27840.712891 20
  839.505588 28925.976563 21
  839.960731 789.263062 1
  840.006726 17731.935547 13
  840.310385 13081.015625 9
  840.508312 9170.716797 7
  841.010348 2484.934570 2
  841.314552 4307.728516 3
  841.443658 848.661621 1
  841.988074 1868.864990 1
  843.976442 930.922729 1
  844.425954 947.441284 1
  844.472316 2952.504150 2
  844.977908 1695.496460 1
  848.011688 1006.896484 1
  849.993351 1694.697998 1
  850.082314 843.938354 1
  851.498243 1115.661987 1
  852.000762 1096.550293 1
  853.294326 1116.146851 1
  856.704572 759.282349 1
  858.954560 1294.299438 1
  859.316142 7435.191406 5
  860.321206 3688.769043 3
  860.488093 931.430542 1
  861.323258 1073.058105 1
  862.016173 1035.225342 1
  865.127836 868.504395 1
  866.268345 1636.532104 1
  868.261211 24694.773438 18
  869.262645 13670.496094 10
  869.732512 962.754395 1
  869.965165 866.327271 1
  870.270663 3081.318359 2
  872.267630 1065.006836 1
  872.637652 810.901367 1
  875.278439 6117.933594 4
  876.282239 2937.670654 2
  877.282858 1141.287231 1
  881.297580 13744.549805 10
  882.301853 6834.294922 5
  890.779820 891.313843 1
  891.101374 1239.804565 1
  891.196869 833.828247 1
  891.252162 15044.841797 11
  891.604151 1726.885498 1
  892.253362 8753.493164 6
  893.256249 3432.273193 2
  897.264443 1622.602905 1
  898.265620 1489.790894 1
  899.258285 6174.762695 4
  900.262802 3417.621338 2
  901.269003 1956.782715 1
  901.586025 1027.485107 1
  903.276215 956.881470 1
  905.578394 1379.306030 1
  905.980119 3555.341064 3
  906.021337 1183.449951 1
  906.078016 914.931763 1
  911.284132 977.639404 1
  913.231053 2109.751709 2
  915.100534 1000.601685 1
  917.931300 856.188721 1
  918.430664 952.056885 1
  918.741000 822.600952 1
  922.821504 1038.299805 1
  931.542379 928.191528 1
  932.047516 4528.165039 3
  932.547684 1631.616577 1
  933.042870 1598.306885 1
  937.208290 857.545044 1
  937.457692 955.987671 1
  939.255239 1997.372559 1
  940.049759 4152.642578 3
  940.550933 3714.496338 3
  941.052508 16756.488281 12
  941.554484 10734.470703 8
  942.051399 6743.314453 5
  942.548708 2742.696777 2
  943.046411 1083.759521 1
  943.062825 848.822632 1
  949.209927 2183.716064 2
  949.281758 1399.553955 1
  952.778154 734.778442 1
  953.033797 808.363281 1
  955.210922 803.968994 1
  959.239515 2026.611816 1
  959.458458 829.879517 1
  967.339430 899.554810 1
  973.289675 1294.548218 1
  981.522105 936.958008 1
  1005.969235 12241.483398 9
  1006.976678 2032.696777 1
  1013.095883 937.022583 1
  1026.751062 860.431030 1
  1033.591378 1141.300903 1
  1041.420347 1808.500244 1
  1042.144568 792.868530 1
  1042.424294 1451.877686 1
  1043.092277 2579.127441 2
  1043.595278 1886.271729 1
  1044.092270 1486.101807 1
  1054.081257 1171.856934 1
  1055.589369 1357.397705 1
  1063.407970 1320.602661 1
  1064.712948 890.889282 1
  1066.184745 1082.075073 1
  1066.382092 1238.206177 1
  1079.368338 1349.490967 1
  1081.804445 810.282593 1
  1085.389646 1141.280273 1
  1091.059647 1170.510986 1
  1092.340838 825.750854 1
  1094.335251 1915.589111 1
  1094.677308 941.659546 1
  1095.341356 2093.863770 2
  1101.351978 1931.868408 1
  1102.353947 2822.956787 2
  1105.854258 955.746216 1
  1105.902895 1312.239746 1
  1105.965432 17682.708984 13
  1106.966746 2517.154297 2
  1107.363475 4253.314453 3
  1108.373661 4128.855469 3
  1109.378249 1048.354858 1
  1112.666632 830.755005 1
  1113.129575 715.471924 1
  1117.323211 7007.943359 5
  1118.332928 2957.816406 2
  1119.322788 1174.393311 1
  1125.332432 4070.808838 3
  1126.331602 2234.471436 2
  1127.339254 1580.409912 1
  1145.139421 1857.876709 1
  1145.644758 2143.139893 2
  1146.135768 1602.392090 1
  1146.641765 1050.483887 1
  1165.985321 12383.314453 9
  1166.993939 2481.205811 2
  1168.811244 1211.378296 1
  1175.285277 836.390747 1
  1186.254671 881.259399 1
  1194.955376 906.831787 1
  1196.392644 985.863647 1
  1203.933660 790.124756 1
  1205.909169 855.184814 1
  1205.956640 7732.828125 6
  1206.954199 2321.150146 2
  1222.422538 930.520508 1
  1222.979891 1241.348145 1
  1228.273479 899.216064 1
  1233.969956 2557.239258 2
  1234.977882 977.905396 1
  1247.169945 870.512207 1
  1250.095847 996.362061 1
  1255.953397 1667.127686 1
  1265.978062 28113.359375 20
  1266.982865 7007.952148 5
  1267.988864 1922.858154 1
  1273.397375 896.052124 1
  1282.954576 1527.079956 1
  1285.867985 1035.493652 1
  1286.016095 887.427368 1
  1295.927486 998.429199 1
  1299.062123 1075.279053 1
  1304.412719 783.935669 1
  1305.944986 1705.618530 1
  1307.435295 1140.179565 1
  1316.259515 792.226685 1
  1317.279618 959.692139 1
  1327.135062 1004.713989 1
  1327.756410 914.770264 1
  1327.811256 959.996338 1
  1328.433079 846.207397 1
  1331.567116 817.271362 1
  1333.966349 7114.896484 5
  1334.970248 2121.679932 2
  1343.395822 1529.843262 1
  1344.391759 2148.505371 2
  1353.414658 1011.302368 1
  1357.931847 965.760498 1
  1361.493560 904.727539 1
  1365.097892 894.731812 1
  1365.974981 17744.246094 13
  1366.977040 5184.055664 4
  1411.000724 1009.253052 1
  1419.793523 834.784180 1
  1433.875934 980.811768 1
  1433.968261 6077.435547 4
  1434.963914 2651.661621 2
  1446.889091 1011.688721 1
  1463.966896 1106.150269 1
  1465.958479 8173.313477 6
  1466.977026 2849.018311 2
  1482.955151 1527.182129 1
  1488.082533 983.670532 1
  1490.264835 1105.480103 1
  1491.624410 860.220337 1
  1492.103423 880.190430 1
  1494.654783 987.907471 1