ACCESSION: MSBNK-NAIST-KNA00648
RECORD_TITLE: L-(-)-Threonine; LC-ESI-ITFT; MS; NEG
DATE: 2016.01.19 (Created 2009.11.19, modified 2011.08.03)
AUTHORS: Takahashi H, Kanaya S, Ogasawara N, Graduate School of Information Science, NAIST
LICENSE: CC BY-SA

CH$NAME: L-Threonine
CH$NAME: 2-Amino-3-hydroxybutyric acid
CH$NAME: L-(-)-Threonine
CH$COMPOUND_CLASS: Natural Product
CH$FORMULA: C4H9NO3
CH$EXACT_MASS: 119.05824
CH$SMILES: [H]C(C)(O)C([H])(N)C(O)=O
CH$IUPAC: InChI=1S/C4H9NO3/c1-2(6)3(5)4(7)8/h2-3,6H,5H2,1H3,(H,7,8)/t2-,3+/m1/s1
CH$LINK: CAS 72-19-5
CH$LINK: CHEBI 16857
CH$LINK: KEGG C00188
CH$LINK: KNAPSACK C00001394
CH$LINK: NIKKAJI J21.883I
CH$LINK: PUBCHEM 3488
CH$LINK: INCHIKEY AYFVYJQAPQTCCC-GBXIJSLDSA-N
CH$LINK: COMPTOX DTXSID2046412

AC$INSTRUMENT: LTQ Orbitrap XL, Thermo Scientfic
AC$INSTRUMENT_TYPE: LC-ESI-ITFT
AC$MASS_SPECTROMETRY: MS_TYPE MS
AC$MASS_SPECTROMETRY: ION_MODE NEGATIVE
AC$MASS_SPECTROMETRY: COLLISION_ENERGY 35eV
AC$MASS_SPECTROMETRY: IONIZATION ESI
AC$CHROMATOGRAPHY: COLUMN_NAME TOSOH TSKgel ODS-100V 5um Part no. 21456
AC$CHROMATOGRAPHY: FLOW_GRADIENT 0min:3%, 45min:97%, 50min:97%, 50.1:3%, 57min:3% (acetonitrile)
AC$CHROMATOGRAPHY: FLOW_RATE 0.5 ml/min
AC$CHROMATOGRAPHY: RETENTION_TIME 4.751228 min
AC$CHROMATOGRAPHY: SOLVENT A 0.1%formate-water
AC$CHROMATOGRAPHY: SOLVENT B 0.1%formate-acetonitrile

MS$FOCUSED_ION: BASE_PEAK 118.051247

PK$SPLASH: splash10-02t9-0692210000-0bc37a3845f5812449b6
PK$NUM_PEAK: 563
PK$PEAK: m/z int. rel.int.
  101.312071 732.613098 2
  101.625098 865.883484 2
  101.956886 893.893005 2
  103.899884 780.940125 2
  103.920296 3907.056152 9
  104.763414 840.940002 2
  104.928110 911.069153 2
  105.867051 766.933044 2
  105.936028 744.346741 2
  106.289996 959.037048 2
  107.742352 843.897278 2
  108.575627 734.126892 2
  110.072189 1628.365723 4
  110.767098 771.282166 2
  111.496184 832.849548 2
  112.013344 756.157410 2
  112.985648 40930.851563 97
  114.511872 880.707092 2
  114.951389 3410.107178 8
  115.148632 786.642517 2
  115.585720 830.261047 2
  118.028848 1509.563477 4
  118.045082 2192.969482 5
  118.047020 6022.658203 14
  118.049201 10429.615234 25
  118.049928 2983.459717 7
  118.051140 421418.781250 999
  118.053563 10506.975586 25
  118.055259 5119.882813 12
  118.057440 1019.778137 2
  118.073680 1717.011719 4
  118.118294 1159.807129 3
  118.882333 881.980652 2
  119.054189 7456.057129 18
  120.054916 1179.172119 3
  120.163098 790.531189 2
  120.612805 935.769958 2
  123.951717 1846.166016 4
  127.273463 781.008362 2
  127.352440 771.651184 2
  127.469549 914.744202 2
  127.980077 4750.037598 11
  129.608777 897.444275 2
  129.770338 949.345276 2
  130.075868 881.330017 2
  131.506923 777.634460 2
  131.681182 804.045471 2
  132.342281 1037.493652 2
  133.318434 791.762146 2
  134.047025 1081.893066 3
  134.684394 757.112854 2
  134.924506 812.263855 2
  137.687689 731.191956 2
  139.006887 5814.442383 14
  139.583365 853.792175 2
  140.114541 956.005676 2
  140.966957 2880.023926 7
  144.024569 3571.786133 8
  145.232201 750.637756 2
  145.890482 2998.672119 7
  145.978413 778.769714 2
  146.965735 1554.002930 4
  147.236068 874.795227 2
  148.952461 1749.867432 4
  150.718268 839.973328 2
  151.982923 3068.585693 7
  153.998562 719.670959 2
  154.027451 4535.770508 11
  154.062128 979.912781 2
  154.947088 5344.126953 13
  154.959478 1244.768555 3
  155.240480 762.446594 2
  156.024370 2085.812012 5
  156.894379 2081.304932 5
  158.030720 2102.119141 5
  158.357012 728.319885 2
  158.925916 1748.575439 4
  160.019406 6107.498535 14
  160.841743 4499.452637 11
  160.892241 1492.366455 4
  161.893591 1044.607422 2
  161.941081 9070.206055 22
  162.279955 779.283264 2
  162.838737 6455.954102 15
  162.893321 3196.982178 8
  163.938025 4034.270996 10
  163.941594 915.968689 2
  164.671756 782.953796 2
  168.428987 893.416687 2
  171.969801 2029.730957 5
  171.990254 1475.926514 3
  173.014571 5424.419922 13
  173.985614 22309.228516 53
  174.007729 1457.642090 3
  174.918078 3423.768555 8
  175.986785 856.543396 2
  176.009283 19342.089844 46
  178.006079 3498.187256 8
  178.258066 722.704529 2
  179.977733 7541.377441 18
  180.840710 753.080017 2
  180.842089 700.726624 2
  181.045803 1211.034668 3
  181.047644 658.277771 2
  183.008899 1003.477844 2
  184.341254 2049.186035 5
  186.037685 4260.535645 10
  186.832681 998.519470 2
  187.859758 867.766174 2
  187.918147 866.469666 2
  187.984842 870.967712 2
  188.014062 5077.761719 12
  188.819814 797.736511 2
  188.982665 819.542175 2
  189.594252 807.155212 2
  189.980538 15252.294922 36
  190.914051 895.609314 2
  192.116807 1043.240234 2
  195.423986 740.838196 2
  196.992107 1677.542480 4
  197.988365 20055.039063 48
  198.987958 1555.600098 4
  198.991670 1465.830078 3
  200.050190 1146.110107 3
  202.002743 2236.533936 5
  203.028011 14418.611328 34
  203.052062 879.638855 2
  204.967316 927.881287 2
  205.951034 1630.345703 4
  206.024763 890.326355 2
  206.198071 766.016052 2
  207.946068 28584.142578 68
  207.950034 1016.559998 2
  208.949623 1359.081543 3
  209.130634 816.697571 2
  209.275269 1017.077087 2
  209.943217 8719.542969 21
  210.998915 1545.168945 4
  212.652517 878.116272 2
  213.032675 698.607849 2
  214.032497 894.128479 2
  214.038413 3763.167236 9
  214.913721 4255.833984 10
  217.031663 843.383728 2
  217.040120 9737.468750 23
  217.975264 5332.957520 13
  218.341139 845.579773 2
  219.001551 1053.570313 2
  220.235034 899.661072 2
  222.024240 1949.546875 5
  223.621640 814.082703 2
  223.984096 1201.868652 3
  225.098458 17951.417969 43
  225.982852 1792.992920 4
  226.101636 1280.376465 3
  230.820856 806.800354 2
  231.029035 1109.637939 3
  232.003383 1420.582275 3
  232.040107 5382.238770 13
  232.146324 812.913391 2
  232.257963 765.571838 2
  235.228618 862.521667 2
  237.101207 1440.813965 3
  237.102586 1466.837402 3
  237.108794 74389.195313 176
  237.112933 1112.514893 3
  237.115003 1799.441406 4
  237.119832 972.206604 2
  237.996292 3066.241211 7
  237.999760 1631.658936 4
  238.112178 5575.703125 13
  241.927536 2048.580566 5
  242.883726 885.725281 2
  243.246715 835.181702 2
  243.922590 32958.156250 78
  245.022471 16563.005859 39
  245.094224 5778.558105 14
  245.919835 15886.254883 38
  246.024788 1517.582275 4
  246.265558 868.700623 2
  246.935733 1358.015625 3
  247.019331 889.495056 2
  247.917372 2366.772461 6
  247.938024 1185.468262 3
  248.008110 1092.059570 3
  248.644669 661.513428 2
  248.647632 892.326477 2
  248.938266 2223.418701 5
  250.941221 1980.111572 5
  251.917401 1384.633545 3
  252.895490 1140.957031 3
  253.030032 7843.541016 19
  253.914445 2306.500244 5
  254.024557 1530.252686 4
  255.009569 2204.708496 5
  257.954604 966.150818 2
  259.077575 2003.189697 5
  259.083878 2037.125977 5
  259.090181 163444.171875 387
  259.095696 1714.975098 4
  259.098060 2788.510010 7
  259.103576 1206.889160 3
  259.110668 828.096008 2
  260.087397 1074.622314 3
  260.093737 8905.753906 21
  261.052924 2065.573486 5
  261.060096 4030.095703 10
  261.062487 910.583923 2
  261.066471 220521.218750 523
  261.070456 3928.058594 9
  261.074441 3811.817383 9
  261.094367 2928.999512 7
  261.219552 1056.110107 3
  262.069519 13592.929688 32
  263.070297 2805.871094 7
  264.159537 1289.924316 3
  264.944040 1109.214844 3
  268.986141 803.095154 2
  269.936322 2093.495605 5
  269.999175 869.048035 2
  270.942094 1990.914795 5
  271.095510 847.142151 2
  273.348433 790.882874 2
  273.435546 1071.396240 3
  274.879796 2134.762939 5
  275.055530 5510.018066 13
  275.064149 5295.249512 13
  275.965310 4061.198730 10
  281.025360 19654.169922 47
  281.072539 2554.818359 6
  282.028467 1943.904785 5
  284.001119 1725.193359 4
  286.025612 5638.367676 13
  287.028070 895.987122 2
  288.024725 3860.071289 9
  288.147592 1005.955017 2
  289.005229 836.226257 2
  289.032150 4669.609863 11
  290.012208 1108.277344 3
  290.019673 74879.390625 178
  290.026205 915.772034 2
  290.029938 2379.969482 6
  290.035537 1059.917725 3
  290.363371 762.605896 2
  290.989758 744.967102 2
  291.012267 1108.128174 3
  291.028212 106484.609375 252
  291.036654 1396.876465 3
  292.015621 6252.366211 15
  292.030706 4894.658691 12
  292.890598 2307.192871 5
  293.027965 2328.920410 6
  294.249550 798.021790 2
  295.023506 1377.467529 3
  299.021518 1162.904297 3
  299.035195 7556.560059 18
  300.000829 1398.566162 3
  303.017623 1090.501465 3
  303.690423 811.768494 2
  304.052704 868.996521 2
  306.672861 842.833679 2
  310.470073 732.434998 2
  313.215690 789.796570 2
  315.095620 813.591980 2
  315.973482 3523.671143 8
  317.049046 1687.812256 4
  318.012220 1585.653809 4
  319.951782 3625.546387 9
  321.018398 1335.605469 3
  321.060782 7131.757813 17
  322.064147 1049.283203 2
  325.009617 4974.985352 12
  325.988192 960.065369 2
  325.997088 3332.081543 8
  326.008209 862.020813 2
  326.994652 1348.443115 3
  327.004707 78134.851563 185
  327.077338 1130.958496 3
  328.008026 7322.790039 17
  328.919023 1001.510803 2
  329.001312 22378.753906 53
  329.126495 815.872986 2
  330.004779 1284.208984 3
  330.617243 977.943176 2
  330.669494 801.055481 2
  331.004881 733.458557 2
  332.936118 2227.864014 5
  333.857365 787.393127 2
  333.984177 1590.585693 4
  334.998961 4209.693359 10
  335.910178 744.146057 2
  335.931116 1425.684814 3
  336.892867 729.372864 2
  336.987516 1016.929871 2
  336.995697 2667.622314 6
  337.033102 3990.148438 9
  339.593661 816.650330 2
  340.159524 991.860535 2
  340.190344 980.346252 2
  341.915788 891.544861 2
  344.926514 1069.070313 3
  345.934473 1061.062500 3
  346.054849 1666.166260 4
  348.986235 1164.591553 3
  351.098330 935.627747 2
  354.023687 1953.837891 5
  357.054580 6835.845215 16
  358.007400 881.629089 2
  359.002589 5003.381836 12
  359.015441 1828.219971 4
  366.138192 4275.549316 10
  370.867883 1215.026123 3
  371.055516 1303.426270 3
  372.863522 972.527893 2
  373.040421 994.520447 2
  375.016596 1381.077148 3
  377.012665 6008.433594 14
  378.011821 1036.318848 2
  378.135432 2420.114014 6
  380.124280 10651.649414 25
  381.127404 2073.889648 5
  386.015315 1008.607239 2
  388.023411 1397.415283 3
  394.113057 14216.928711 34
  395.117191 1859.311035 4
  398.088193 1473.750000 3
  399.086479 1232.217041 3
  400.082477 14403.640625 34
  400.130863 3329.627686 8
  402.009540 1515.574951 4
  402.079600 1099.711426 3
  402.107020 3649.435791 9
  404.790906 799.187561 2
  405.172769 824.455627 2
  406.529038 873.859070 2
  406.902509 1186.843018 3
  408.010441 2288.461670 5
  408.091421 3573.580078 8
  409.077568 6886.611816 16
  409.088511 883.403137 2
  410.072001 1009.461731 2
  410.086122 82909.929688 197
  410.095536 1124.554688 3
  410.100243 1184.469482 3
  411.088960 10463.367188 25
  412.085999 3316.087158 8
  414.081438 1202.570557 3
  414.141939 825.324768 2
  415.822138 857.670349 2
  418.080510 2488.624268 6
  421.156325 933.403015 2
  421.288623 805.503357 2
  422.065703 7380.744141 17
  424.063201 910.030579 2
  426.021747 5672.340820 13
  426.129752 1308.404541 3
  427.465760 756.483948 2
  431.059880 5016.194336 12
  432.067706 7007.341797 17
  434.044440 2668.206787 6
  442.051724 1007.682678 2
  449.977726 1192.319336 3
  451.088862 998.073303 2
  452.073339 1086.266602 3
  453.672014 780.898254 2
  454.002635 1775.664551 4
  455.270007 1097.231445 3
  455.310386 795.901794 2
  459.185914 832.427551 2
  462.101667 1857.000977 4
  464.004933 4849.997559 11
  464.713883 894.057068 2
  465.136242 846.634827 2
  465.485170 861.050354 2
  467.990334 8408.731445 20
  468.118514 1304.900391 3
  477.024835 988.172791 2
  478.073753 2727.731445 6
  478.552037 997.408875 2
  480.711232 835.662292 2
  483.653820 840.175354 2
  485.985283 1069.662842 3
  489.070489 989.673767 2
  493.847998 853.097473 2
  495.984327 5905.700684 14
  497.668565 811.546448 2
  498.092540 1199.113037 3
  499.182243 16032.605469 38
  500.053624 1294.963623 3
  500.186747 2456.603760 6
  500.317809 806.387024 2
  502.115580 717.209167 2
  503.976492 936.098206 2
  505.912259 937.398010 2
  517.733405 935.130310 2
  519.176421 1034.697021 2
  529.946101 3699.338623 9
  533.106327 782.279114 2
  533.893226 3746.731934 9
  534.154358 772.438293 2
  535.154021 2067.334961 5
  535.919675 782.181213 2
  539.358318 782.212341 2
  540.035791 969.251770 2
  541.170924 1638.614258 4
  545.282844 886.624329 2
  545.966693 3093.521973 7
  547.611736 956.331848 2
  547.955692 1315.093018 3
  549.989695 1214.905273 3
  550.116434 1991.501465 5
  551.127038 4811.336426 11
  552.584360 828.985901 2
  557.088050 1048.019287 2
  558.900960 1203.328369 3
  563.105903 1722.660400 4
  569.037104 60645.214844 144
  570.041171 8761.774414 21
  573.108249 2295.352051 5
  575.083355 1045.950439 2
  582.056007 1859.630859 4
  583.062823 2176.598145 5
  587.444366 680.371155 2
  587.452437 726.002136 2
  591.003174 864.812317 2
  591.019462 2440.679199 6
  591.353497 870.393616 2
  605.043439 1171.359131 3
  605.099678 804.363586 2
  615.706827 786.519226 2
  617.068592 915.518005 2
  620.018584 5381.486816 13
  622.954529 1083.687012 3
  623.995726 1648.161133 4
  636.274693 810.665833 2
  639.718104 764.932678 2
  639.730332 796.508118 2
  640.780175 905.537292 2
  646.478090 812.544861 2
  649.004029 5235.622070 12
  652.951585 1298.879883 3
  655.103580 822.310242 2
  656.817580 876.880676 2
  657.734465 1023.780945 2
  658.570245 1057.407959 3
  663.402194 2132.075195 5
  676.193771 1512.623535 4
  683.359435 1478.158203 4
  683.386436 998.118591 2
  688.095420 16081.316406 38
  689.099102 1750.886230 4
  690.022786 968.827576 2
  691.800098 787.648132 2
  692.168082 1788.608643 4
  701.379713 1198.722900 3
  702.120780 963.815979 2
  710.078849 2751.206787 7
  714.099704 1080.440186 3
  725.785305 882.437439 2
  726.580197 975.325500 2
  733.853458 794.480774 2
  742.068353 5999.339844 14
  758.917429 841.732849 2
  760.155278 854.127502 2
  765.469079 913.578674 2
  784.149778 4172.200195 10
  785.154699 887.602112 2
  796.503116 1265.926514 3
  800.142477 960.209900 2
  808.116724 2333.952148 6
  811.901621 841.357361 2
  819.236995 924.940613 2
  827.521602 799.436340 2
  830.638141 869.692688 2
  832.990520 722.289246 2
  833.676807 800.127869 2
  834.833140 764.639221 2
  858.921268 908.704773 2
  864.873093 927.579651 2
  873.695458 882.688904 2
  879.974366 844.489441 2
  887.513883 812.890198 2
  888.558827 779.751282 2
  898.988321 878.283508 2
  901.391702 779.772644 2
  905.974967 2176.553223 5
  906.980441 1338.381348 3
  907.584530 878.405212 2
  918.530586 956.609802 2
  939.734007 798.997864 2
  942.718211 883.262512 2
  961.894327 954.984314 2
  970.587580 989.728455 2
  993.280901 953.888855 2
  1005.969235 17594.427734 42
  1006.976678 3471.711914 8
  1007.224246 855.921204 2
  1016.063212 863.663269 2
  1024.907450 862.021057 2
  1043.098642 908.691345 2
  1065.271083 885.696960 2
  1065.994028 1086.086914 3
  1067.284008 919.639221 2
  1069.652858 1050.898438 2
  1099.689656 846.371155 2
  1104.903023 892.869568 2
  1105.965432 20641.910156 49
  1106.966746 5017.490723 12
  1118.679229 847.689026 2
  1124.690811 860.403259 2
  1133.716507 791.357117 2
  1137.679057 852.746765 2
  1153.835093 990.464417 2
  1155.265559 770.216125 2
  1157.948347 934.269714 2
  1165.985321 13056.696289 31
  1166.986407 2439.977051 6
  1200.822238 1224.906494 3
  1205.885434 844.883484 2
  1205.956640 9409.434570 22
  1206.962121 2063.515137 5
  1232.439942 830.280579 2
  1238.634780 1205.404297 3
  1239.013723 920.351990 2
  1239.854607 945.936951 2
  1250.229467 1082.387451 3
  1255.953397 1058.830322 3
  1262.724936 898.313782 2
  1265.978062 35660.605469 85
  1266.982865 6799.043457 16
  1267.988864 1360.010986 3
  1279.808821 869.370422 2
  1282.971940 2572.251709 6
  1305.891489 1021.209656 2
  1305.953902 2057.276855 5
  1318.861765 876.584412 2
  1323.907432 842.244690 2
  1333.966349 5273.981934 13
  1339.024966 1517.885254 4
  1355.052947 975.106384 2
  1355.948671 1311.358398 3
  1365.974981 23484.837891 56
  1366.977040 6022.378906 14
  1367.980202 1799.902588 4
  1382.957032 2521.120361 6
  1388.287367 843.014832 2
  1400.327048 1074.182373 3
  1403.947636 957.107971 2
  1433.958002 4493.795410 11
  1434.963914 2324.530273 6
  1439.029106 887.273621 2
  1448.002329 943.899841 2
  1448.772984 895.654602 2
  1455.946543 1267.016846 3
  1465.969084 11334.980469 27
  1466.839036 968.366272 2
  1466.966411 2548.573975 6
  1467.986008 1357.884521 3
  1473.377744 903.035828 2
  1475.335036 1039.059326 2
  1482.944362 1571.593994 4
  1487.096102 875.398743 2
  1487.865651 1279.442139 3