ACCESSION: MSBNK-NAIST-KNA00676
RECORD_TITLE: Uridine; LC-ESI-ITFT; MS; NEG
DATE: 2016.01.19 (Created 2009.11.19, modified 2011.08.03)
AUTHORS: Takahashi H, Kanaya S, Ogasawara N, Graduate School of Information Science, NAIST
LICENSE: CC BY-SA

CH$NAME: Uridine
CH$COMPOUND_CLASS: Natural Product
CH$FORMULA: C9H12N2O6
CH$EXACT_MASS: 244.06954
CH$SMILES: OC[C@@H](O1)[C@@H](O)[C@@H](O)[C@@H]1N(C=2)C(=O)NC(=O)C2
CH$IUPAC: InChI=1S/C9H12N2O6/c12-3-4-6(14)7(15)8(17-4)11-2-1-5(13)10-9(11)16/h1-2,4,6-8,12,14-15H,3H2,(H,10,13,16)/t4-,6-,7-,8-/m1/s1
CH$LINK: CAS 58-96-8
CH$LINK: CHEBI 16704
CH$LINK: KEGG C00299
CH$LINK: KNAPSACK C00019674
CH$LINK: NIKKAJI J4.593D
CH$LINK: PUBCHEM 3593
CH$LINK: INCHIKEY DRTQHJPVMGBUCF-XVFCMESISA-N
CH$LINK: COMPTOX DTXSID40891555

AC$INSTRUMENT: LTQ Orbitrap XL, Thermo Scientfic
AC$INSTRUMENT_TYPE: LC-ESI-ITFT
AC$MASS_SPECTROMETRY: MS_TYPE MS
AC$MASS_SPECTROMETRY: ION_MODE NEGATIVE
AC$MASS_SPECTROMETRY: COLLISION_ENERGY 35eV
AC$MASS_SPECTROMETRY: IONIZATION ESI
AC$CHROMATOGRAPHY: COLUMN_NAME TOSOH TSKgel ODS-100V 5um Part no. 21456
AC$CHROMATOGRAPHY: FLOW_GRADIENT 0min:3%, 45min:97%, 50min:97%, 50.1:3%, 57min:3% (acetonitrile)
AC$CHROMATOGRAPHY: FLOW_RATE 0.5 ml/min
AC$CHROMATOGRAPHY: RETENTION_TIME 9.188585 min
AC$CHROMATOGRAPHY: SOLVENT A 0.1%formate-water
AC$CHROMATOGRAPHY: SOLVENT B 0.1%formate-acetonitrile

MS$FOCUSED_ION: BASE_PEAK 279.038513

PK$SPLASH: splash10-004l-0291010000-9f969df6ba0ab1a415d0
PK$NUM_PEAK: 620
PK$PEAK: m/z int. rel.int.
  101.047298 658.336914 1
  101.947551 690.660889 1
  102.013705 665.991760 1
  102.251222 790.708862 1
  102.366769 870.313477 1
  102.670744 842.961060 1
  102.948638 1209.959595 2
  102.956730 2600.395752 3
  104.400308 695.182007 1
  104.852812 716.275024 1
  104.953904 1114.618896 1
  105.350542 826.207886 1
  106.130966 729.043213 1
  106.144395 868.342529 1
  106.778200 731.410278 1
  107.150649 734.789307 1
  107.205783 730.828369 1
  107.797097 803.108765 1
  108.045559 2763.166748 4
  108.385855 766.488403 1
  109.387906 821.783203 1
  109.971676 748.375610 1
  110.021371 2171.599854 3
  110.023115 4302.242188 6
  110.024641 116430.632813 154
  110.026385 5307.418945 7
  110.028130 1524.571655 2
  110.300325 734.042236 1
  111.014191 707.522827 1
  111.014854 956.669678 1
  111.016622 2183.911377 3
  111.018390 8943.364258 12
  111.019937 166744.937500 221
  111.021705 7636.363281 10
  111.023253 2302.385742 3
  111.027894 4472.500000 6
  111.708908 723.850464 1
  111.709577 741.408813 1
  112.023200 3768.597168 5
  112.300138 725.020020 1
  112.983832 1458.704346 2
  112.985421 19625.537109 26
  112.986555 948.777100 1
  112.987009 989.424805 1
  113.066922 805.781738 1
  113.770709 813.959473 1
  113.897831 712.509766 1
  113.921948 768.318604 1
  114.951855 2350.324463 3
  116.884319 688.067444 1
  116.884797 686.318542 1
  117.788167 1052.583862 1
  118.749711 898.494873 1
  119.274887 714.459595 1
  120.147670 781.552246 1
  120.217119 822.293457 1
  122.024533 3063.702637 4
  123.732739 790.105103 1
  123.961886 727.340576 1
  125.000702 868.811523 1
  126.880755 2049.852295 3
  127.717067 847.560059 1
  130.252065 757.009399 1
  130.803438 970.916260 1
  131.053365 770.633423 1
  131.177887 1097.802002 1
  132.380546 987.863403 1
  133.013878 1008.305786 1
  133.059973 833.176514 1
  134.046731 2194.946777 3
  136.909280 850.358521 1
  139.006887 1644.554077 2
  140.031854 789.332642 1
  140.034985 7551.096680 10
  140.689733 769.332886 1
  143.655944 773.426880 1
  147.528473 782.201782 1
  148.909538 1491.871826 2
  148.952117 6493.730469 9
  149.935121 919.591675 1
  151.475863 682.592651 1
  152.034974 18006.845703 24
  152.317999 860.078857 1
  152.985764 738.114014 1
  153.030103 6323.318359 8
  157.006197 831.677612 1
  158.846456 2732.252197 4
  158.924781 6643.577148 9
  159.025515 893.194092 1
  159.282707 712.220581 1
  159.877998 1995.317627 3
  159.893658 830.749634 1
  160.309688 858.212402 1
  160.841743 28048.585938 37
  160.844826 1202.452393 2
  160.888771 726.397827 1
  160.891855 984.693970 1
  160.921163 805.651733 1
  161.024187 725.165405 1
  161.076702 840.185547 1
  161.875302 1212.839111 2
  162.131250 741.707764 1
  162.444119 736.770996 1
  162.838737 24254.115234 32
  162.841485 1246.319824 2
  163.802878 790.254883 1
  164.165496 816.386353 1
  164.835565 4934.866211 7
  164.927165 1264.073364 2
  164.966788 1163.748657 2
  167.921349 910.100220 1
  168.836094 872.051392 1
  169.189782 774.999512 1
  169.195603 756.251953 1
  170.737456 921.212158 1
  170.832332 873.634521 1
  170.943754 831.386841 1
  171.514812 836.363525 1
  171.551739 920.426514 1
  171.571693 812.121216 1
  171.970653 699.556763 1
  174.446558 828.378662 1
  174.832880 836.339111 1
  174.884429 825.874512 1
  174.955673 2285.670654 3
  176.970983 967.279785 1
  177.031935 718.391235 1
  177.087576 811.945679 1
  180.961608 1342.242188 2
  182.044958 1079.613403 1
  182.778985 696.377625 1
  182.949510 1692.027222 2
  184.326124 1974.904053 3
  184.875804 2515.715576 3
  186.027618 975.963501 1
  186.873216 1379.978394 2
  186.969299 3045.816406 4
  186.992968 744.901245 1
  187.330631 777.755493 1
  187.860244 1572.563965 2
  189.515362 871.605591 1
  190.924517 855.257935 1
  192.282432 1093.108032 1
  192.505786 757.291138 1
  197.220579 753.877686 1
  198.935996 865.606934 1
  200.051793 887.947266 1
  200.055536 37834.742188 50
  200.183366 824.010010 1
  201.058994 1357.380859 2
  202.750645 796.102783 1
  202.885981 912.907959 1
  209.007840 824.350220 1
  209.279273 848.809570 1
  209.446968 755.187134 1
  210.971702 4764.869141 6
  211.000652 1078.460938 1
  211.504180 716.787598 1
  212.472767 853.878174 1
  216.222667 958.792358 1
  217.175503 826.946411 1
  218.981346 1309.736694 2
  219.103230 752.031738 1
  220.930119 2533.564697 3
  221.984243 806.451538 1
  225.127173 869.958496 1
  227.231211 892.001709 1
  228.535627 767.174194 1
  228.937585 1464.736206 2
  230.958727 3286.195557 4
  233.938884 1165.250732 2
  233.942264 878.388428 1
  234.642847 810.913452 1
  234.865060 738.276733 1
  236.268787 755.742065 1
  236.700271 853.795898 1
  237.978257 953.587280 1
  238.966930 4312.009766 6
  239.457627 980.530762 1
  239.970906 803.363403 1
  241.546925 774.492065 1
  242.371058 806.798828 1
  242.742187 1026.013306 1
  242.995328 1147.945435 2
  243.050442 5598.564453 7
  243.056170 14746.842773 20
  243.061181 461499.750000 612
  243.066909 14514.223633 19
  243.072637 4428.251953 6
  243.127777 1542.137817 2
  243.259617 941.242554 1
  244.064442 35724.503906 47
  244.069485 857.218506 1
  245.065229 3527.866699 5
  247.003195 1596.780273 2
  249.920684 817.136719 1
  255.919859 702.574341 1
  256.873918 966.768677 1
  258.759574 881.712646 1
  259.021646 28094.451172 37
  262.148088 804.715576 1
  263.805421 810.099731 1
  263.894490 944.213257 1
  265.391097 773.576538 1
  266.102349 778.763062 1
  266.671601 1000.861450 1
  268.218483 941.225952 1
  271.062624 851.541870 1
  271.503286 735.046143 1
  272.956090 2673.936768 4
  277.301385 867.639526 1
  278.794881 1256.315552 2
  278.957657 2300.155273 3
  279.004317 1406.090088 2
  279.015763 1349.010864 2
  279.017524 1816.153564 2
  279.024569 8287.896484 11
  279.032494 21002.912109 28
  279.038659 753086.750000 999
  279.044823 22119.798828 29
  279.051869 6468.118164 9
  279.058034 897.269531 1
  279.060676 1122.704590 1
  279.071245 1390.040405 2
  279.074768 987.954224 1
  279.119695 2193.039551 3
  280.034679 3124.347168 4
  280.041762 58221.582031 77
  280.045303 1732.356445 2
  280.139180 882.394897 1
  280.981752 1368.661255 2
  281.021800 3026.339355 4
  281.028920 7015.391602 9
  281.035151 227526.343750 302
  281.041382 4016.326416 5
  281.044943 1822.120850 2
  281.048503 2128.405518 3
  282.032046 922.360718 1
  282.038310 15969.377930 21
  283.041451 789.759399 1
  283.108938 807.127686 1
  287.034501 2569.839600 3
  287.151220 743.996582 1
  288.027495 761.759521 1
  289.066502 39578.355469 53
  289.073931 1301.053833 2
  290.070069 4683.897461 6
  290.966314 1415.407837 2
  292.393099 740.840088 1
  296.980511 3098.520752 4
  297.340534 834.368286 1
  298.996120 5136.635742 7
  299.370581 750.145508 1
  300.818301 1666.435425 2
  301.019491 5671.576172 8
  302.576629 816.994385 1
  303.346756 776.776123 1
  304.988416 1479.986450 2
  306.049804 1416.928223 2
  306.056885 35192.714844 47
  306.063966 978.494263 1
  306.992724 1160.473755 2
  307.060823 3225.613770 4
  307.791006 762.416504 1
  308.097294 809.573364 1
  309.008646 1717.849854 2
  310.820744 834.311401 1
  311.036198 1080.539551 1
  311.048635 8312.272461 11
  314.101478 824.535645 1
  315.987278 3397.751465 5
  319.013159 873.268555 1
  322.998728 1052.012451 1
  323.027245 2016.299561 3
  324.047564 847.207886 1
  324.884563 695.930786 1
  325.004082 1674.706299 2
  325.948164 853.672729 1
  327.013645 956.882080 1
  327.022583 1432.663330 2
  328.043944 3388.989502 4
  329.793082 839.103394 1
  331.867855 810.535767 1
  332.956779 5864.795898 8
  333.030253 2046.317139 3
  333.092266 4744.121094 6
  333.959962 833.371704 1
  334.953787 1186.482544 2
  336.995698 1407.751831 2
  337.449648 772.299683 1
  340.964579 1950.721924 3
  341.028821 1935.558105 3
  341.038340 1207.510376 2
  342.968162 1363.887573 2
  342.986163 14058.314453 19
  345.831170 981.271118 1
  346.054849 11895.165039 16
  347.057990 1141.362793 2
  350.992706 5323.668945 7
  352.998987 4817.947266 6
  354.189866 901.521729 1
  355.590657 1065.731079 1
  357.054580 4872.677734 6
  358.978173 1674.880981 2
  360.974358 1866.281250 2
  362.166789 766.730103 1
  365.276703 857.967407 1
  367.926332 4858.098633 6
  368.003678 3274.976563 4
  368.933739 3938.484619 5
  369.007386 2627.851807 3
  369.922437 3431.528076 5
  370.008482 1703.373413 2
  370.618376 827.880615 1
  370.929962 1387.225952 2
  372.002601 742.831543 1
  372.104289 2758.355957 4
  373.018642 864.057373 1
  378.895092 1816.400879 2
  379.035866 2362.159668 3
  383.074766 5397.603516 7
  383.090348 2105.252686 3
  385.950843 2251.707275 3
  386.005285 1827.296631 2
  386.015315 30250.738281 40
  386.826165 1026.854492 1
  386.949811 1233.098755 2
  387.018848 2343.527344 3
  388.430960 969.406128 1
  388.565505 740.851807 1
  388.950720 2453.598633 3
  388.956517 787.244751 1
  389.150794 792.213013 1
  389.398925 829.118286 1
  399.060874 3979.464600 5
  400.944145 1237.536011 2
  402.009540 2406.242676 3
  403.901479 1304.180664 2
  404.176135 768.614624 1
  405.899490 1068.933228 1
  407.850110 1090.483276 1
  408.010441 7755.453125 10
  410.972455 2518.100830 3
  414.725338 1018.053833 1
  416.693393 925.300781 1
  419.020449 811.779541 1
  420.373613 926.439331 1
  420.999608 1755.242432 2
  422.927084 894.867798 1
  426.020086 13952.314453 19
  427.025284 1168.997925 2
  428.013968 3417.347900 5
  432.419156 885.035767 1
  432.956498 913.986206 1
  433.424936 809.228882 1
  438.305687 842.308960 1
  446.572550 765.784912 1
  448.983908 962.817383 1
  451.681338 790.378296 1
  452.991816 797.014648 1
  460.985144 932.917358 1
  465.024441 4555.893555 6
  465.521223 874.712158 1
  465.980790 6242.277344 8
  469.862778 942.676147 1
  487.130934 33523.359375 44
  488.133903 4845.400391 6
  489.938055 2282.512939 3
  490.972317 841.685669 1
  494.119731 6531.637695 9
  495.117311 23446.394531 31
  496.117916 3828.778564 5
  497.121556 1189.509766 2
  503.090578 1570.617920 2
  504.939769 3752.645996 5
  505.987513 1381.396240 2
  507.798661 896.431519 1
  507.950029 3558.810059 5
  509.052727 2578.260498 3
  509.113491 1853.829834 2
  510.374612 959.696533 1
  511.087690 11893.640625 16
  512.093329 1480.742310 2
  518.892695 12687.685547 17
  521.780990 760.516968 1
  522.949390 2216.802002 3
  523.107583 60829.066406 81
  524.110385 12325.023438 16
  525.104705 16134.109375 21
  526.106418 3771.559814 5
  526.152019 816.991211 1
  527.200182 1659.691895 2
  527.907572 8152.832031 11
  529.197809 1180.568848 2
  529.946101 2207.172119 3
  531.047243 1220.935425 2
  532.976122 879.790405 1
  533.213318 874.995728 1
  533.893226 2570.773193 3
  535.306085 1464.577881 2
  536.046272 1501.442139 2
  538.044916 1240.987549 2
  540.021565 768.516479 1
  540.028678 677.398499 1
  540.042904 29159.164063 39
  540.052389 57227.949219 76
  541.044885 2580.938477 3
  541.056774 5778.657227 8
  542.059195 1320.248901 2
  544.141951 857.814697 1
  546.980380 1062.144653 1
  547.955692 1726.494385 2
  549.057559 1462.989258 2
  550.828938 817.240845 1
  551.061044 1649.649780 2
  552.270365 826.727417 1
  554.868858 2218.354736 3
  555.902497 2899.216553 4
  558.063134 22362.916016 30
  558.898464 4835.801758 6
  559.065755 3996.485107 5
  562.034496 1325.522217 2
  562.165422 3087.471924 4
  563.032698 4961.497070 7
  563.300345 1319.713379 2
  563.451928 773.047607 1
  564.036093 1167.776123 2
  564.165187 1861.812988 2
  564.897557 2149.084961 3
  566.015326 916.018066 1
  567.024157 9127.989258 12
  567.070077 2564.068115 3
  567.912934 971.666626 1
  567.948733 1130.362183 1
  568.028014 1503.256226 2
  569.021717 2571.169189 3
  570.190338 831.774780 1
  570.555788 959.370361 1
  570.821088 804.411255 1
  572.077975 10849.848633 14
  575.057300 2572.907471 3
  576.056453 3217.220215 4
  577.034641 729.833496 1
  577.052974 27603.210938 37
  577.100117 3475.679199 5
  578.057334 4096.688477 5
  579.048523 1173.642578 2
  579.059054 1070.775391 1
  579.899768 983.130737 1
  581.769582 893.305054 1
  590.636891 915.186646 1
  593.962157 1716.013184 2
  604.759549 835.314453 1
  608.029303 1052.983398 1
  609.024772 2077.756348 3
  620.018584 3121.869873 4
  620.900400 905.180786 1
  621.078744 7143.979492 9
  622.082992 1351.462280 2
  622.176807 1063.907837 1
  627.034153 3151.838135 4
  629.014490 1295.839966 2
  640.556523 830.046753 1
  643.060126 2558.381348 3
  645.042639 1343.803101 2
  652.995719 813.162720 1
  653.124994 691.455505 1
  653.361572 848.875000 1
  660.323522 806.880127 1
  660.641011 977.728149 1
  662.099904 17460.279297 23
  663.089165 3427.871338 5
  663.105295 3225.143066 4
  664.116211 6041.080078 8
  670.315782 990.818970 1
  672.659723 888.301636 1
  673.745437 817.217529 1
  673.999920 1354.027466 2
  680.821769 810.372192 1
  685.070395 1227.583374 2
  688.730147 754.949829 1
  730.085828 943.719116 1
  730.801943 952.994751 1
  731.197749 985.091064 1
  733.286644 814.667725 1
  734.281818 2753.875000 4
  735.011646 1066.318604 1
  739.185682 1909.275391 3
  741.030634 871.891113 1
  742.064534 3479.279297 5
  744.315284 885.986572 1
  749.006375 797.625610 1
  753.183189 1118.878418 1
  753.968763 2929.043701 4
  754.971077 1267.608887 2
  762.958505 1599.341187 2
  765.241061 944.623779 1
  766.105670 1582.092896 2
  773.120278 4540.685547 6
  774.014552 1858.769531 2
  774.120341 4050.258057 5
  775.024504 1121.945679 1
  775.114192 58996.953125 78
  775.163120 2203.178711 3
  776.118129 16253.837891 22
  776.534967 834.473633 1
  777.107645 2405.649658 3
  777.124017 1654.362427 2
  777.959652 1266.027466 2
  778.115458 1237.508911 2
  784.149778 1411.896118 2
  792.079269 848.130005 1
  797.098028 10954.328125 15
  798.102391 2809.813721 4
  800.108269 1300.749512 2
  802.967913 1303.531250 2
  806.093646 1269.316895 2
  806.422366 885.396729 1
  806.863858 862.281982 1
  811.141644 1185.384399 2
  833.076827 993.328491 1
  842.865788 1068.086426 1
  849.310202 758.754517 1
  854.024723 786.968628 1
  859.063962 863.313110 1
  865.012467 1199.399170 2
  867.010645 1029.185059 1
  872.998162 1090.499634 1
  874.046860 969.645020 1
  875.038761 1100.168945 1
  875.704231 799.836670 1
  885.320016 782.051758 1
  905.974967 3239.236572 4
  906.170774 13839.992188 18
  907.171413 3495.033203 5
  918.499030 986.437012 1
  922.054011 927.173462 1
  925.842529 851.296265 1
  933.382192 2160.604248 3
  944.086842 845.190674 1
  954.302417 823.485229 1
  961.077589 843.638428 1
  972.636018 780.816162 1
  1002.673973 813.148926 1
  1003.622404 985.700439 1
  1005.969235 16802.425781 22
  1006.970641 4039.911865 5
  1007.387328 875.200928 1
  1019.184969 1137.943726 2
  1040.176958 974.219849 1
  1041.166413 4549.406250 6
  1042.169993 2337.688477 3
  1043.875589 848.105591 1
  1057.133188 986.865967 1
  1099.124911 979.851440 1
  1100.668660 830.591553 1
  1105.965432 21481.523438 28
  1106.966746 6055.500977 8
  1107.962453 1176.453735 2
  1109.071146 778.228638 1
  1133.074908 935.348999 1
  1143.720408 895.521606 1
  1150.237365 2404.368164 3
  1151.240374 829.007568 1
  1155.955800 2976.309326 4
  1156.958865 1224.609985 2
  1157.085270 882.751343 1
  1163.154644 899.758179 1
  1165.985321 8951.771484 12
  1166.993939 2219.864258 3
  1182.973150 1612.425171 2
  1184.804807 1007.145142 1
  1205.956640 7820.732422 10
  1206.962121 1533.067505 2
  1210.781702 947.771851 1
  1216.036262 1186.564209 2
  1217.592008 855.471680 1
  1226.908297 788.374146 1
  1235.453593 984.357300 1
  1239.623691 936.882568 1
  1245.266556 800.254028 1
  1250.171005 922.646729 1
  1255.314532 964.628174 1
  1255.944988 7683.989258 10
  1256.306663 1052.904907 1
  1256.963124 1878.937744 2
  1257.948782 2146.150146 3
  1258.944038 1020.319580 1
  1265.978062 26628.236328 35
  1266.982865 8869.447266 12
  1267.971803 1373.755493 2
  1282.971940 4677.306641 6
  1283.979661 953.147095 1
  1285.989956 982.852661 1
  1299.159435 1322.718872 2
  1301.267576 982.252319 1
  1305.944986 1333.512573 2
  1316.178318 904.366699 1
  1333.966349 1769.845215 2
  1339.145319 998.203003 1
  1355.939238 4321.505859 6
  1357.941301 2268.533203 3
  1358.347920 918.129028 1
  1365.974981 22307.466797 30
  1366.967491 5503.541016 7
  1382.966749 3610.364258 5
  1396.079637 782.675171 1
  1431.898162 845.122437 1
  1433.947743 1125.678955 1
  1455.925551 1879.511475 2
  1457.932294 1553.119141 2
  1465.969084 9575.769531 13
  1466.966411 3129.033936 4
  1477.607380 873.545166 1
  1478.358835 858.733521 1
  1482.955151 1346.797974 2
  1487.811438 1138.443604 2
  1490.547474 999.969360 1
  1495.124334 1034.621826 1
  1499.393178 942.263428 1