ACCESSION: MSBNK-NAIST-KNA00728
RECORD_TITLE: L-Homoserine; LC-ESI-ITFT; MS; NEG
DATE: 2016.01.19 (Created 2009.11.19, modified 2011.08.03)
AUTHORS: Takahashi H, Kanaya S, Ogasawara N, Graduate School of Information Science, NAIST
LICENSE: CC BY-SA

CH$NAME: L-Homoserine
CH$NAME: 2-Amino-4-hydroxybutyric acid
CH$COMPOUND_CLASS: Natural Product
CH$FORMULA: C4H9NO3
CH$EXACT_MASS: 119.05824
CH$SMILES: OCC[C@H](N)C(O)=O
CH$IUPAC: InChI=1S/C4H9NO3/c5-3(1-2-6)4(7)8/h3,6H,1-2,5H2,(H,7,8)/t3-/m0/s1
CH$LINK: CAS 672-15-1
CH$LINK: CHEBI 15699
CH$LINK: KEGG C00263
CH$LINK: KNAPSACK C00001366
CH$LINK: NIKKAJI J9.199E
CH$LINK: PUBCHEM 3561
CH$LINK: INCHIKEY UKAUYVFTDYCKQA-VKHMYHEASA-N
CH$LINK: COMPTOX DTXSID5075159

AC$INSTRUMENT: LTQ Orbitrap XL, Thermo Scientfic
AC$INSTRUMENT_TYPE: LC-ESI-ITFT
AC$MASS_SPECTROMETRY: MS_TYPE MS
AC$MASS_SPECTROMETRY: ION_MODE NEGATIVE
AC$MASS_SPECTROMETRY: COLLISION_ENERGY 35eV
AC$MASS_SPECTROMETRY: IONIZATION ESI
AC$CHROMATOGRAPHY: COLUMN_NAME TOSOH TSKgel ODS-100V 5um Part no. 21456
AC$CHROMATOGRAPHY: FLOW_GRADIENT 0min:3%, 45min:97%, 50min:97%, 50.1:3%, 57min:3% (acetonitrile)
AC$CHROMATOGRAPHY: FLOW_RATE 0.5 ml/min
AC$CHROMATOGRAPHY: RETENTION_TIME 4.657770 min
AC$CHROMATOGRAPHY: SOLVENT A 0.1%formate-water
AC$CHROMATOGRAPHY: SOLVENT B 0.1%formate-acetonitrile

MS$FOCUSED_ION: BASE_PEAK 118.051132

PK$SPLASH: splash10-014i-0891100000-9741f4de33403c1154ad
PK$NUM_PEAK: 498
PK$PEAK: m/z int. rel.int.
  100.040280 1345.088379 2
  100.623754 782.334839 1
  100.742284 759.802368 1
  101.628195 759.227539 1
  102.711442 921.343384 1
  102.920423 760.107422 1
  103.123118 684.995361 1
  103.258778 792.181641 1
  103.363132 746.242065 1
  103.920096 2237.114258 4
  104.660372 702.306030 1
  104.802119 738.463989 1
  106.526200 728.437744 1
  107.491986 747.512451 1
  108.020738 823.509644 1
  109.490433 810.619385 1
  109.969933 777.257080 1
  110.649797 723.147827 1
  111.482839 765.894531 1
  112.983832 1575.819702 3
  112.985421 45620.796875 74
  112.986782 1516.286377 2
  112.987463 1605.563110 3
  112.998809 794.490845 1
  113.098502 866.165649 1
  114.120462 858.428345 1
  114.951622 12101.360352 20
  115.233654 748.902710 1
  115.530801 806.777100 1
  115.790954 789.763672 1
  115.851712 667.052124 1
  116.510150 722.847534 1
  117.925229 792.185303 1
  117.984285 1409.641113 2
  118.028848 3805.286865 6
  118.034421 877.325317 1
  118.040720 694.109497 1
  118.041932 1683.062012 3
  118.042659 1835.950684 3
  118.045082 4629.644531 8
  118.047020 10906.145508 18
  118.049201 21247.134766 35
  118.051140 613809.437500 999
  118.053321 21287.484375 35
  118.055017 9926.622070 16
  118.056229 1468.194702 2
  118.057198 4547.623535 7
  118.059379 1115.223389 2
  118.060349 1398.061646 2
  118.061076 1368.753174 2
  118.062045 1389.888916 2
  118.068105 837.258301 1
  118.073437 3693.993896 6
  118.118294 1139.086670 2
  119.053944 8448.175781 14
  119.054925 2591.688965 4
  119.055662 724.920044 1
  119.619939 721.309326 1
  121.610229 844.028809 1
  123.639440 818.532471 1
  124.749714 1059.625488 2
  127.022905 744.644287 1
  127.159604 905.307251 1
  127.943704 2159.180176 4
  129.513489 811.834229 1
  129.675151 786.216431 1
  133.231519 766.586548 1
  134.047025 1137.525146 2
  134.572542 783.444092 1
  134.819748 828.805420 1
  136.713369 772.619507 1
  136.917755 746.301147 1
  139.006578 5228.755371 9
  139.460066 700.541748 1
  140.385981 878.235474 1
  140.621972 723.662964 1
  143.080591 923.504639 2
  143.974945 1351.424927 2
  144.024242 2326.847900 4
  144.180789 760.376953 1
  145.890149 1008.529785 2
  147.921970 806.941528 1
  148.374734 788.614990 1
  148.952117 1121.006836 2
  148.953491 882.409058 1
  149.796126 651.599854 1
  150.570154 784.959106 1
  151.982569 4645.688477 8
  153.499353 899.078491 1
  154.027090 7010.148926 11
  154.029257 1093.093384 2
  154.393233 796.636230 1
  156.024001 2890.669189 5
  158.030345 1389.760376 2
  158.924781 1184.034058 2
  159.034987 2904.039795 5
  160.019023 3278.033447 5
  160.242600 910.792236 1
  160.841358 3099.699219 5
  161.904489 1458.852295 2
  162.014693 1357.122925 2
  162.218263 932.642822 2
  162.257304 744.038818 1
  162.838737 2500.859375 4
  165.998396 1130.153076 2
  168.961335 1925.581543 3
  171.071772 848.334961 1
  171.969375 1731.718018 3
  172.977601 1153.954712 2
  172.988347 1036.530762 2
  173.960469 799.198486 1
  173.985614 27836.246094 45
  174.007729 2540.223633 4
  174.918078 953.192871 2
  176.008842 4882.620117 8
  178.005631 2075.359619 3
  178.981500 1159.240356 2
  179.063864 761.447021 1
  179.274556 855.546387 1
  179.977276 11816.985352 19
  179.979101 2110.043945 3
  181.045803 1817.500488 3
  183.713482 764.441040 1
  184.345983 2002.643311 3
  184.415989 753.955322 1
  186.037685 2971.831543 5
  187.703700 867.345947 1
  188.013575 5835.889160 9
  189.980043 6004.203125 10
  190.673064 780.523438 1
  192.891898 783.195923 1
  192.927839 985.407593 2
  193.993403 1208.155396 2
  196.991585 1459.957886 2
  197.987839 13288.228516 22
  200.390614 924.137695 2
  202.002201 4171.197266 7
  202.829211 851.324097 1
  202.944414 981.678223 2
  202.987572 2998.290039 5
  203.028011 6588.951660 11
  203.229294 726.111084 1
  203.231483 696.549561 1
  205.924234 805.828491 1
  207.946068 19594.183594 32
  209.935171 798.510132 1
  209.943217 6373.510254 10
  210.135880 767.804199 1
  212.003681 1117.429443 2
  212.279219 818.187378 1
  214.913125 4769.445313 8
  215.060822 2856.312744 5
  215.953807 1427.131348 2
  215.995184 2580.225098 4
  216.505872 1011.508667 2
  217.076371 4595.012695 7
  217.974656 8574.430664 14
  219.703719 776.303589 1
  219.975300 962.067749 2
  221.358208 750.434326 1
  222.098638 854.867065 1
  225.982852 2800.353271 5
  226.559669 909.057983 1
  227.614808 798.055786 1
  228.570879 811.024292 1
  232.033429 1090.233887 2
  232.040107 5177.014648 8
  232.042778 1373.090820 2
  232.924121 2097.754395 3
  237.035003 2938.551758 5
  237.102586 4614.330078 8
  237.104656 1868.376221 3
  237.108105 111824.679688 182
  237.112243 2848.979736 5
  237.114313 2975.605957 5
  237.995598 2327.203125 4
  237.999760 875.907349 1
  238.111484 6212.811523 10
  239.112863 1307.189331 2
  239.249141 901.309326 1
  239.975120 1288.515381 2
  243.922590 12762.578125 21
  243.988820 1137.081299 2
  244.448855 686.214355 1
  244.978999 897.927612 1
  244.981173 886.462036 1
  244.985519 12123.387695 20
  245.919835 7606.492188 12
  246.029891 5088.425293 8
  248.938266 1425.115479 2
  248.959045 1068.277588 2
  250.050619 760.933838 1
  251.998251 1220.944580 2
  252.609279 766.606445 1
  253.030032 1021.403198 2
  253.913680 970.547485 2
  255.868816 757.984863 1
  257.706655 796.735107 1
  257.989048 987.859985 2
  259.083878 1612.460327 3
  259.090181 83031.640625 135
  259.097272 1868.388916 3
  260.087397 959.803223 2
  260.093737 4957.310059 8
  261.046549 1914.758301 3
  261.052924 2855.543701 5
  261.060096 7218.064453 12
  261.066471 281711.250000 458
  261.070456 6326.269043 10
  261.073644 6304.701172 10
  261.079223 3238.559082 5
  261.086396 1566.682251 3
  262.069519 18635.726563 30
  263.070297 3051.578857 5
  265.478520 875.023438 1
  271.631804 754.184448 1
  271.985698 1539.033325 3
  273.048982 837.782349 1
  274.879796 3878.274170 6
  275.054668 5847.728516 10
  275.064149 1268.822510 2
  275.879583 1484.135498 2
  275.964444 1125.528931 2
  278.175000 861.214600 1
  279.029852 5444.519043 9
  280.028481 1706.656860 3
  281.017350 963.708496 2
  281.025360 47239.800781 77
  281.028920 2045.097656 3
  281.072539 4332.776367 7
  282.027572 2670.358643 4
  283.845655 783.197876 1
  285.042035 1038.552124 2
  286.025612 5616.671875 9
  286.696696 948.827026 2
  288.024725 3222.094971 5
  289.011727 974.456543 2
  289.032150 3151.979980 5
  290.012208 1113.369385 2
  290.019673 59746.101563 97
  290.024339 1234.711060 2
  290.029005 1459.220947 2
  291.027274 84504.859375 138
  291.033840 2145.112061 3
  291.035716 1998.928223 3
  292.030706 4345.303711 7
  292.890598 2136.310059 3
  293.027965 2541.441406 4
  299.021518 1149.266724 2
  299.035195 8547.471680 14
  299.040080 1074.061646 2
  299.736922 773.885986 1
  299.924270 1058.018311 2
  300.036174 1010.863525 2
  305.082023 785.177246 1
  310.991639 698.348633 1
  313.009476 1208.370483 2
  319.950701 1928.057617 3
  321.017311 2192.627197 4
  321.060782 7503.544922 12
  325.008510 2543.144287 4
  325.995976 3253.680908 5
  326.007097 1825.433350 3
  326.992418 947.486938 2
  327.003590 38878.960938 63
  327.077338 1789.123779 3
  327.993436 1281.601440 2
  328.003536 1293.669556 2
  328.008026 1959.034424 3
  329.001312 8334.435547 14
  330.003647 823.698975 1
  330.053487 815.188965 1
  330.736531 731.997070 1
  337.033102 3260.824707 5
  341.116886 815.501831 1
  344.947090 1169.731445 2
  347.978408 890.736328 1
  348.985003 1453.489380 2
  351.801638 849.508545 1
  352.953883 1566.186523 3
  354.022428 1872.288574 3
  355.138821 1032.001831 2
  357.053306 4658.138184 8
  359.001304 1002.462646 2
  359.014156 2322.579834 4
  371.055516 1244.660767 2
  372.336295 1082.221313 2
  372.567159 857.846436 1
  373.022725 1053.384155 2
  376.294510 829.854614 1
  376.672666 1004.884888 2
  377.012665 3943.366455 6
  378.036816 999.847778 2
  378.135432 1917.124023 3
  380.124280 22259.414063 36
  381.127404 2091.859619 3
  382.860959 866.802124 1
  386.925364 826.508057 1
  386.938306 1297.623901 2
  392.561111 765.904663 1
  393.009685 741.925171 1
  394.113057 13791.745117 22
  395.019275 846.831421 1
  395.115707 977.022339 2
  397.542529 990.078125 2
  397.948672 861.745728 1
  400.082477 8399.004883 14
  400.129350 2388.707764 4
  401.082209 1218.867554 2
  402.105496 5401.433594 9
  402.193868 919.480713 1
  406.122062 900.104248 1
  408.010441 1683.599731 3
  408.089863 2230.944336 4
  409.004108 959.270630 2
  409.077568 11712.800781 19
  409.086948 1779.063721 3
  410.072001 1664.253662 3
  410.086122 45809.531250 75
  411.088960 3002.191406 5
  414.352203 990.466797 2
  414.691831 790.722412 1
  416.539160 833.458496 1
  417.888382 1165.238892 2
  418.070820 1700.401489 3
  421.605740 878.287964 1
  422.064065 2512.406982 4
  426.020086 4253.637207 7
  426.129752 1395.603516 2
  429.063173 875.823853 1
  430.010087 1104.961792 2
  431.059880 6204.749512 10
  432.067706 5778.980957 9
  434.029065 816.874756 1
  434.042732 1755.318115 3
  442.051724 1816.435303 3
  445.053794 1592.977905 3
  454.002635 2253.806641 4
  458.089199 900.966064 1
  458.754924 928.604004 2
  459.880116 890.793823 1
  462.009720 1236.011963 2
  462.099790 1919.500000 3
  462.998185 1433.057373 2
  464.004933 3953.839111 6
  468.043895 2629.006592 4
  469.280275 820.301025 1
  470.020605 4060.475342 7
  471.004003 2047.699463 3
  476.975629 818.587524 1
  478.073753 3356.674805 5
  478.920132 756.598633 1
  479.697294 830.899780 1
  492.583560 969.557129 2
  494.959160 829.180542 1
  497.052459 733.882690 1
  498.973703 1070.352905 2
  499.097969 802.245361 1
  499.182243 34819.687500 57
  499.218066 778.576660 1
  500.186747 3795.115479 6
  511.793513 822.435913 1
  516.054893 872.303223 1
  520.820791 757.046875 1
  520.995992 795.441406 1
  528.136806 4163.929199 7
  529.549884 896.160889 1
  533.890895 883.649048 1
  535.154021 2170.624756 4
  543.100271 1525.658325 2
  550.118872 1090.052734 2
  551.124594 6722.198730 11
  552.093860 1805.246338 3
  552.653083 964.775269 2
  552.947752 959.158936 2
  553.102547 5075.308105 8
  553.830712 816.463013 1
  558.898464 1059.915527 2
  559.360569 791.128296 1
  573.959413 851.323242 1
  574.643272 815.687378 1
  575.521335 895.087280 1
  582.056007 2641.673584 4
  583.062823 2878.001709 5
  589.069797 1250.744141 2
  595.038427 1101.193481 2
  603.639997 855.783569 1
  604.035273 850.586670 1
  605.043439 1526.164673 2
  613.097155 897.449341 1
  618.658676 804.533325 1
  619.112451 1073.086792 2
  620.018584 2453.138672 4
  637.948770 1268.315430 2
  645.860539 849.642578 1
  652.948433 1366.360596 2
  677.957908 1398.811157 2
  683.119872 815.889526 1
  683.359435 1459.426758 2
  685.873983 867.475952 1
  686.148952 981.898438 2
  692.164642 2829.661377 5
  702.117265 1158.770630 2
  708.191512 1095.941895 2
  711.690280 1090.016357 2
  715.486148 827.637573 1
  737.922929 1085.029419 2
  742.064534 2929.904297 5
  745.848416 928.980835 2
  746.183337 774.637817 1
  762.071393 925.629028 2
  790.015383 964.837769 2
  808.116724 6216.560059 10
  809.120249 2176.416260 4
  833.204041 1247.616333 2
  833.444920 980.715454 2
  840.038924 952.053711 2
  840.163136 870.606445 1
  843.064619 929.095581 2
  843.161748 1457.298096 2
  853.247235 926.613037 2
  872.837366 860.288574 1
  874.134744 742.090088 1
  882.118680 771.941162 1
  891.081272 846.816895 1
  901.407041 840.435669 1
  902.917293 1026.198608 2
  905.974967 2419.732666 4
  911.143820 888.940186 1
  912.064234 810.879761 1
  953.150538 863.780396 1
  955.763347 808.860107 1
  957.563442 909.578979 1
  963.519631 873.926880 1
  971.731160 845.178345 1
  980.082893 1052.626099 2
  999.239699 917.731201 1
  1005.969235 15716.985352 26
  1006.976678 2529.486084 4
  1028.705617 870.920166 1
  1033.905352 1018.574219 2
  1047.850271 872.292236 1
  1062.138088 971.311279 2
  1065.152854 790.894287 1
  1065.994028 1118.713379 2
  1070.360420 947.409180 2
  1071.181276 852.386353 1
  1091.938519 885.901489 1
  1105.965432 18009.175781 29
  1106.966746 4680.086426 8
  1107.969421 1110.855347 2
  1109.943929 883.245361 1
  1129.487699 864.971436 1
  1131.232445 818.110229 1
  1152.185581 943.564087 2
  1155.955800 982.967773 2
  1165.406333 901.990479 1
  1165.985321 13497.750000 22
  1166.986407 4110.947266 7
  1171.889954 957.601685 2
  1182.973150 1066.053955 2
  1189.929770 847.038818 1
  1205.956640 8859.764648 14
  1206.962121 2459.181641 4
  1207.976791 934.673828 2
  1208.706876 1143.171997 2
  1213.109301 849.633301 1
  1233.969956 1410.327271 2
  1256.946286 1109.118896 2
  1257.957211 1722.902832 3
  1265.978062 31845.085938 52
  1266.982865 7967.804199 13
  1267.988864 1530.577148 2
  1282.963258 3290.077148 5
  1287.166990 779.795898 1
  1300.709039 796.269287 1
  1305.873658 1148.403198 2
  1305.953902 1723.936157 3
  1306.953119 936.103516 2
  1309.653159 896.860352 1
  1326.413749 961.673340 2
  1333.966349 5720.210938 9
  1334.961032 1496.586548 2
  1357.506514 910.218384 1
  1363.840935 882.109497 1
  1365.965443 20692.744141 34
  1366.977040 8071.658691 13
  1371.504776 942.184570 2
  1382.957032 2056.990967 3
  1433.958002 3648.853271 6
  1434.963914 2068.448730 3
  1455.925551 1298.063232 2
  1456.818092 919.889160 1
  1465.969084 12161.360352 20
  1466.966411 4042.788330 7
  1473.612841 972.607056 2
  1482.955151 1351.209839 2
  1493.225652 813.437988 1